program: Gaussian 09
title: 000225875
version: EM64L-G09RevD.01
frameworkgroup: C1[X(C14H21NO2)]
method: RPBEPBE
basis: SDD
operation: Freq
keyword: #p
keyword: freq=noraman
keyword: PBEPBE/SDD
title: #p freq=noraman PBEPBE/SDD
converged: YES YES NO NO
title: Mulliken charges:
elementType: O O N C C C C C C C C C C C C C C H H H H H H H H H H H H H H H H H H H H H
charge: -0.269073 -0.265147 -0.128662 -0.335562 -0.512479 -0.358077 -0.320734 0.508793 -0.340847 -0.484305 -0.680985 -0.464643 0.210310 0.156132 -0.694444 -0.328107 -0.204959 0.177016 0.196894 0.202204 0.221836 0.207357 0.187996 0.226703 0.185284 0.191702 0.192067 0.286956 0.206688 0.230974 0.209364 0.236385 0.215238 0.210161 0.212608 0.247741 0.229139 0.238476
chargesum: 0.00000
title: Mulliken charges with hydrogens summed into heavy atoms:
elementType: O O N C C C C C C C C C C C C C C
charge: -0.269073 -0.265147 -0.128662 0.038347 -0.088439 0.037276 0.091253 0.508793 0.042922 -0.197350 -0.033958 -0.228259 0.210310 0.156132 -0.056438 -0.080366 0.262656
polarizability: 2.12526912e+02 -9.32855760e+00 1.36124567e+02 6.09916335e+00 -1.60897890e+01 1.49083360e+02
1716.lowfreq: -5.9413 -0.0005 -0.0004 -0.0001 3.0936 6.8283 23.7531 29.3996 47.2346
frequency: 23.5411 29.3976 47.2140 50.8753 60.4122 87.0673 103.1924 117.3397 133.7709 159.5661 214.0777 224.0038 228.5255 233.3065 269.7071 299.9117 325.3983 329.4820 402.8920 417.9026 423.8389 450.2468 490.2275 544.7846 586.2342 606.0667 676.0365 717.6064 731.6925 749.6739 777.2361 782.1228 793.0674 799.6549 812.6937 839.1433 895.2624 901.8390 915.2501 926.0511 931.0894 950.0135 975.7505 1000.7629 1018.9130 1054.1074 1059.9082 1072.2696 1075.4645 1084.8616 1103.2828 1120.2394 1125.4654 1129.4834 1163.9664 1170.8132 1193.9288 1228.7446 1240.7183 1247.0887 1264.0542 1271.8265 1282.4614 1287.8568 1295.0654 1342.8097 1352.8830 1363.6934 1366.5640 1374.1247 1386.6669 1392.7724 1406.4351 1438.3787 1460.7095 1463.7636 1466.6880 1471.5327 1473.6444 1477.2947 1478.3306 1481.4740 1485.4038 1487.2248 1489.8349 1611.1072 1629.2567 2843.1535 2847.2820 2861.6037 2961.6426 2972.5943 2974.2518 2982.9469 2993.1566 3003.7206 3006.8589 3026.5498 3030.2622 3047.9861 3069.6956 3072.2273 3075.1059 3089.8688 3103.7674 3131.3185 3173.8876 3178.3425
redmass: 4.4111 4.4564 3.2203 1.6240 2.7718 2.2975 2.3370 2.2361 3.5490 2.8696 1.8248 3.1363 1.4529 2.3723 2.3806 2.3092 4.8434 2.6793 3.9656 3.2494 2.9981 3.1930 3.2260 4.7661 4.7188 5.4174 9.0156 4.8333 1.0764 4.4811 4.4119 3.0658 1.1837 1.1834 1.5107 8.5476 1.5658 1.5951 2.3488 1.5945 1.3560 2.0391 5.1206 1.7801 3.1251 3.1949 2.5549 1.4982 2.4471 2.3560 1.8530 1.9263 1.3542 1.1866 1.7931 1.7113 2.1506 1.4166 1.4334 4.1119 1.2203 1.3593 1.1022 1.2239 1.2747 1.5074 1.6345 1.2796 1.3576 1.4730 1.2357 1.2211 2.7380 4.5134 1.0728 1.3432 1.0670 1.1138 1.1200 1.4742 1.0447 1.0673 1.2639 1.0735 1.0854 7.9659 8.2763 1.0721 1.0718 1.0709 1.0588 1.0448 1.0530 1.0357 1.0614 1.0979 1.0846 1.0902 1.0882 1.0984 1.1005 1.0995 1.0982 1.1002 1.1096 1.0897 1.0928 1.0952
irintensity: 0.0190 0.2414 0.1244 0.0743 0.0733 13.7797 2.0726 0.4984 1.0918 1.4805 0.1512 0.1451 0.1567 0.7145 1.1575 0.3765 0.7496 3.7486 0.8225 2.0038 8.0486 5.9605 5.5392 7.9706 2.8376 2.9316 0.9857 0.9031 8.2552 11.8731 15.0711 9.8369 1.0323 12.2911 39.8029 34.4200 14.4682 13.8704 1.1152 11.6532 4.3470 12.5907 140.7184 12.9703 3.1946 8.4378 40.5312 7.3537 15.2237 10.9180 12.6041 11.0464 4.3401 3.8619 18.1494 11.3762 14.2406 10.4341 9.1691 198.1426 0.6599 9.7897 0.5118 11.1169 22.8793 0.8356 24.2375 2.2994 8.1185 8.1719 23.8743 8.9723 6.3103 54.1599 11.1980 72.6684 1.7162 4.6590 20.0324 34.0357 13.0816 1.3572 20.8439 5.5596 26.2670 4.4010 0.3461 32.6033 44.1126 223.3179 21.4460 30.8442 62.4151 31.0188 131.9049 6.4124 18.8824 9.0199 12.6179 48.4236 88.4468 61.3286 53.5325 42.0941 33.1577 11.0344 2.6520 7.2283
temp: 298.150 k
press: 1.00000 atm
elementType: 8 8 7 6 6 6 6 6 6 6 6 6 6 6 6 6 6 1 1 1 1 1 1 1 1 1 1 1 1 1 1 1 1 1 1 1 1 1
symmnumber: 1
zpe: 848578.6 jmol-1
zpe.correction: 0.323207 hartree
zpe.thermalcorrener: 0.341265 hartree
zpe.thermalcorrenthalpy: 0.342210 hartree
zpe.thermalcorrgfe: 0.274860 hartree
zpe.sumelectzpe: -749.927139 hartree
zpe.sumelectthermal: -749.909080 hartree
zpe.sumelectthermalent: -749.908136 hartree
zpe.sumelectthermalfe: -749.975485 hartree
dipole: -0.9152 0.2233 -0.5534
dipole: 1.0926
quadrupole: -97.9073 -101.4512 -101.4082
quadrupole: -4.9131 3.4839 -2.0929
quadrupole: 2.3482 -1.1957 -1.1526 -4.9131 3.4839 -2.0929
hfenergy: -750.2503455 hartree
pointgroup: C01 [X(C14H21N1O2)]
dipole: -0.3590574 -0.0195721 -0.2355089 debye
polarizability: 212.314104|-6.2484254|125.8059593|9.9611485|-3.9881736|159.614776 unknown
InChI: InChI=1S/C14H21NO2/c1-3-5-8-15(4-2)10-12-6-7-13-14(9-12)17-11-16-13/h6-7,9H,3-5,8,10-11H2,1-2H3
charge 0 multiplicity 1
38 atoms
O  2.875323 -0.371025 1.955895
O  4.526024 -0.516045 0.221099
N  -1.732888 0.88772 -0.410796
C  -3.191975 0.604984 -0.444538
C  -0.966389 0.014754 -1.333257
C  -3.585907 -0.650898 0.362163
C  -1.398729 2.327036 -0.594029
C  0.513647 -0.092293 -0.972094
C  -5.102588 -0.944125 0.302874
C  0.895899 -0.158461 0.4007
C  -1.715574 3.181982 0.647073
C  1.495998 -0.172161 -1.989051
C  2.252306 -0.316736 0.678501
C  3.225676 -0.40445 -0.341033
C  -5.500456 -2.192552 1.119599
C  2.879001 -0.331427 -1.690762
C  4.295261 -0.707394 1.677367
H  -3.565019 0.505185 -1.4969
H  -3.719277 1.474227 -0.010105
H  -1.05819 0.346763 -2.399164
H  -1.419475 -0.994543 -1.286301
H  -3.267604 -0.504828 1.412783
H  -3.032858 -1.536377 -0.012024
H  -0.313111 2.387921 -0.793847
H  -1.914553 2.752678 -1.492569
H  -5.410869 -1.079455 -0.754363
H  -5.661648 -0.062613 0.678859
H  0.135757 -0.065186 1.180466
H  -2.792336 3.174929 0.896028
H  -1.160779 2.799676 1.5216
H  -1.42036 4.233681 0.474051
H  1.18609 -0.109584 -3.038713
H  -6.588758 -2.380405 1.069025
H  -4.983496 -3.094681 0.741295
H  -5.226282 -2.072423 2.184589
H  3.635687 -0.385423 -2.477543
H  4.471421 -1.769884 1.933608
H  4.944734 -0.016365 2.23651
