program: Gaussian 09
title: 000000790
version: EM64L-G09RevD.01
frameworkgroup: C1[X(C5H4N4O)]
method: RPBEPBE
basis: SDD
operation: Freq
keyword: #pfreq=noraman
keyword: PBEPBE/SDD
title: #p freq=noraman PBEPBE/SDD
converged: NO NO NO YES
title: Mulliken charges:
elementType: O N N N N C C C C C H H H H
charge: -0.237136 -0.368327 -0.316432 -0.071966 0.001978 0.096862 0.095182 0.034965 -0.198764 -0.234475 0.344162 0.335192 0.271401 0.247359
chargesum: 0.00000
title: Mulliken charges with hydrogens summed into heavy atoms:
elementType: O N N N N C C C C C
charge: -0.237136 -0.024165 0.018760 -0.071966 0.001978 0.096862 0.095182 0.034965 0.072637 0.012884
polarizability: 1.04739834e+02 -1.96372809e+00 9.82501881e+01 -1.56811401e-03 1.62592006e-03 3.37445582e+01
1716.lowfreq: -11.0530 -0.0005 0.0001 0.0005 12.0828 15.3292 131.3392 185.5789 285.3827
frequency: 131.3316 185.5781 285.3826 293.5189 486.8904 507.3161 511.5868 596.6050 614.9288 628.7480 678.2943 682.6777 704.8217 775.5732 815.5521 856.5572 901.9800 921.5048 974.7802 1061.5285 1095.0886 1164.9474 1247.8414 1302.9790 1325.4529 1365.1464 1382.1545 1417.1463 1499.0746 1530.1732 1582.3415 1618.5987 3140.4151 3250.9831 3547.1852 3584.5636
redmass: 7.7475 6.7757 7.3121 4.9050 10.0002 7.3075 3.6163 8.3380 2.5227 1.4152 5.1068 8.4459 1.2485 7.1584 1.5192 7.7712 1.4438 8.1118 6.3398 2.2010 1.8594 2.5734 2.6788 3.5709 2.7692 1.5234 2.7029 2.7736 7.5442 3.5624 7.0516 11.1058 1.0927 1.0995 1.0795 1.0826
irintensity: 3.7270 0.1626 15.9187 28.9256 3.1408 3.9873 0.9538 1.4841 75.7340 31.7981 26.9046 3.8766 133.9702 0.1091 16.5735 1.5617 11.8583 7.1597 44.3615 15.8349 22.0058 15.9069 19.9052 0.8018 14.3013 28.9296 60.9113 101.1439 83.3562 50.3558 35.6611 460.6180 17.3849 1.6166 75.6437 88.9802
temp: 298.150 k
press: 1.00000 atm
elementType: 8 7 7 7 7 6 6 6 6 6 1 1 1 1
symmnumber: 1
zpe: 255218.8 jmol-1
zpe.correction: 0.097208 hartree
zpe.thermalcorrener: 0.104162 hartree
zpe.thermalcorrenthalpy: 0.105106 hartree
zpe.thermalcorrgfe: 0.065510 hartree
zpe.sumelectzpe: -486.463850 hartree
zpe.sumelectthermal: -486.456896 hartree
zpe.sumelectthermalent: -486.455952 hartree
zpe.sumelectthermalfe: -486.495548 hartree
dipole: 4.2245 -2.8879 -0.0007
dipole: 5.1173
quadrupole: -63.3030 -49.6534 -58.0969
quadrupole: 18.7950 0.0019 -0.0019
quadrupole: -6.2853 7.3643 -1.0791 18.7950 0.0019 -0.0019
hfenergy: -486.5610578 hartree
pointgroup: C01 [X(C5H4N4O1)]
dipole: 1.7813657 -0.9381175 -0.0002776 debye
dipolederiv: -0.6507417 0.2488592 -0.0000885 0.4576604 -1.0899783 0.0001504 0.0001648 -0.0003076 -0.3752029 -0.2775487 0.0192388 0.0000136 -0.0111528 -0.5698196 0.0000017 -0.0000257 -0.000011 -0.2107603 -0.802442 0.0131121 0.0000343 0.0702877 -0.6119744 0.0000289 0.0000928 -0.00003 -0.2109448 -0.4195326 -0.221742 0.0000086 -0.0400471 -0.5137665 0.000018 0.0000304 0.000007 -0.2520998 -0.4278218 -0.1009237 -0.0000523 0.2608326 -1.1011437 -0.0000078 0.00004 0.0000856 -0.2833486 -0.5242755 0.4991738 0.0000389 0.3068942 -0.0507787 0.0000119 -0.0000563 0.0000195 0.0070855 0.5196555 0.3285312 -0.0000135 0.1160242 0.5472986 -0.0000666 -0.000062 0.0000019 0.0694 1.0587055 -0.2664311 0.0000784 -0.4642794 1.5739847 -0.0001136 -0.0000593 0.0001669 0.2598551 0.1017168 -0.1249492 0.0000244 -0.1725462 0.6027642 0.0000156 -0.0000465 0.0000143 -0.0604337 0.9103876 -0.3548412 -0.0000622 -0.3939996 0.7101292 -0.0000428 -0.0000954 0.0000466 0.0064783 0.2086119 0.0565496 -0.0000083 0.0193236 0.271936 -0.0000054 0.0000022 -0.0000118 0.3608616 0.1728516 0.0043992 0.0000092 -0.034053 0.2424607 0.0000061 0.0000219 -0.0000138 0.3556068 0.0508563 -0.0525947 -0.0000057 -0.0424161 0.080248 -0.0000127 0.0000161 -0.000003 0.1933152 0.079577 -0.0483821 0.000023 -0.0725286 -0.0913603 0.0000165 -0.0000231 0.0000355 0.1401876 unknown
polarizability: 105.101868|-1.1728973|97.8881542|-0.0017442|0.0014354|33.7445582 unknown
InChI: InChI=1S/C5H4N4O/c10-5-3-4(7-1-6-3)8-2-9-5/h1-2,6,8H
charge 0 multiplicity 1
14 atoms
O  -1.80837 1.944369 0.000167
N  1.257467 1.411522 -0.000121
N  -0.094249 -1.849336 -0.000117
N  2.127412 -0.697148 -0.000204
N  -2.053053 -0.422532 -0.000049
C  0.160517 0.54555 -0.000224
C  0.738094 -0.738442 -0.00016
C  -1.279043 0.794669 -0.000419
C  2.40639 0.630998 -0.000082
C  -1.471128 -1.60901 -0.000009
H  1.190308 2.429735 -0.000119
H  0.291895 -2.795841 -0.000133
H  3.40964 1.049075 -0.000047
H  -2.098379 -2.50771 0.000116
