program: Gaussian 09
title: 000225871
version: EM64L-G09RevD.01
frameworkgroup: C1[X(C14H18O3)]
method: RPBEPBE
basis: SDD
operation: Freq
keyword: #pfreq=noraman
keyword: PBEPBE/SDD
title: #p freq=noraman PBEPBE/SDD
converged: YES YES NO NO
title: Mulliken charges:
elementType: O O O C C C C C C C C C C C C C C H H H H H H H H H H H H H H H H H H
charge: -0.293566 -0.200350 -0.268937 -0.151766 -0.564643 0.298305 0.176903 -0.016508 -0.612275 -0.826132 -0.021444 0.263659 -0.480487 0.454400 -0.587859 -0.776684 -0.800436 0.278159 0.254508 0.272236 0.216864 0.260317 0.253451 0.254856 0.248480 0.236309 0.255156 0.218277 0.212887 0.229933 0.239489 0.230537 0.300958 0.221079 0.224324
chargesum: 0.00000
title: Mulliken charges with hydrogens summed into heavy atoms:
elementType: O O O C C C C C C C C C C C C C C
charge: -0.293566 -0.200350 -0.268937 0.126394 -0.037898 0.298305 0.176903 -0.016508 -0.135095 -0.069345 0.214865 0.263659 -0.225331 0.454400 -0.156695 -0.076726 -0.054075
polarizability: 2.43760127e+02 -1.49754082e+01 1.57638934e+02 -1.59356073e-01 2.21831618e+00 1.17107796e+02
1716.lowfreq: -9.1307 -5.0860 -0.0002 0.0008 0.0009 5.9448 19.2795 26.3757 33.7585
frequency: 19.0748 25.9583 33.4914 42.2727 55.2425 68.1201 79.4686 101.1803 115.4196 126.3878 143.8163 165.1580 191.5718 220.0250 232.6700 257.2794 275.8473 289.6584 350.9952 369.6890 389.7308 420.2680 453.1911 466.5776 510.3097 536.9922 566.0777 604.1493 617.4325 662.6766 689.1027 718.4746 773.1440 799.0342 842.7897 871.8565 873.9152 911.7358 925.8541 939.3246 949.3459 957.8355 972.4918 986.2363 1003.2424 1020.6906 1033.0607 1051.1450 1060.9252 1078.0329 1087.4289 1114.6150 1127.3538 1152.5696 1199.7399 1222.8121 1236.1146 1247.3657 1274.2744 1286.5090 1294.7568 1313.3096 1343.0346 1364.0555 1388.8042 1396.8239 1397.0456 1421.8324 1430.5112 1449.3464 1452.4912 1455.0795 1458.4091 1465.8230 1467.2753 1484.8713 1610.5600 1619.8697 1652.1668 1658.2444 1660.8415 2968.1991 2972.7452 2975.1660 2975.5983 3013.5174 3027.1025 3038.1230 3039.6086 3045.3214 3046.6904 3083.5085 3089.1024 3094.8936 3099.8555 3109.1408 3128.1674 3145.4091 3194.8686
redmass: 3.9953 3.2910 4.0519 3.4815 1.0737 3.7066 3.9526 2.8282 1.1058 3.4140 1.4028 2.6855 2.3054 3.4895 3.1038 3.9309 3.6994 4.5919 3.3346 3.8033 2.4128 2.8990 3.5579 2.2892 2.7867 3.3786 3.3388 2.2106 3.9839 4.1884 4.0817 4.3896 3.3743 3.2623 3.5263 1.4746 2.4783 1.9257 2.1972 1.3683 1.6420 2.0869 3.1241 1.2332 1.2483 2.2002 1.6950 2.8390 1.9864 2.3481 1.7413 1.9702 2.1723 1.2767 2.4243 1.3779 3.1849 1.5359 1.5803 1.2737 1.5494 1.3996 3.1426 1.4778 1.3732 1.2530 1.2477 1.1849 1.0872 1.0710 1.0887 1.0501 1.0621 1.0767 1.1052 1.0461 9.3269 11.1021 4.6975 5.7922 8.2292 1.0384 1.0387 1.0493 1.0499 1.0827 1.0623 1.0955 1.0989 1.0955 1.0949 1.0605 1.1016 1.0992 1.0939 1.0980 1.0972 1.0907 1.1141
irintensity: 0.1780 1.1263 1.4668 2.4478 0.1497 0.8350 1.7909 0.7713 2.0364 3.6179 0.9182 0.2050 1.0094 1.0479 3.3783 10.1604 0.7511 12.0008 5.1136 1.5010 8.2000 2.0931 1.5031 9.8103 1.9985 0.8032 9.8068 3.5182 2.8489 15.5375 2.5584 9.6398 7.3209 1.7944 0.6203 18.9132 9.7966 5.4802 9.9551 125.2544 20.8196 30.7144 163.1983 7.0889 24.5547 22.8395 11.9362 230.5743 166.3355 27.1487 9.0038 151.1792 6.6653 13.3650 23.5567 6.6269 69.3241 5.9200 18.5612 4.1966 1.1903 6.0557 21.2438 23.0644 46.9294 50.7545 10.2581 5.5055 17.1692 35.3329 25.0370 6.2361 11.2898 46.8878 42.9661 28.3299 146.4755 347.1014 25.5920 212.4016 4.5781 6.2653 54.3389 13.3886 13.1264 18.8299 6.7710 5.1169 6.1036 28.6305 7.5571 12.9514 6.0090 22.6053 11.2504 14.1410 1.8688 6.3955 28.6427
temp: 298.150 k
press: 1.00000 atm
elementType: 8 8 8 6 6 6 6 6 6 6 6 6 6 6 6 6 6 1 1 1 1 1 1 1 1 1 1 1 1 1 1 1 1 1 1
symmnumber: 1
zpe: 745452.5 jmol-1
zpe.correction: 0.283928 hartree
zpe.thermalcorrener: 0.303274 hartree
zpe.thermalcorrenthalpy: 0.304219 hartree
zpe.thermalcorrgfe: 0.232964 hartree
zpe.sumelectzpe: -768.650590 hartree
zpe.sumelectthermal: -768.631244 hartree
zpe.sumelectthermalent: -768.630300 hartree
zpe.sumelectthermalfe: -768.701555 hartree
dipole: 4.4714 -2.5437 1.1691
dipole: 5.2755
quadrupole: -94.0095 -106.6493 -100.5502
quadrupole: 11.5382 6.6585 -3.4069
quadrupole: 6.3935 -6.2463 -0.1472 11.5382 6.6585 -3.4069
hfenergy: -768.9345183 hartree
pointgroup: C01 [X(C14H18O3)]
dipole: 1.6777459 1.2215558 0.0289594 debye
polarizability: 241.3384666|19.8364062|150.6957173|6.1984805|17.7353776|126.4726739 unknown
InChI: InChI=1S/C14H18O3/c1-5-6-11-10(4)13(8-12(11)15)17-14(16)7-9(2)3/h5,7,13H,1,6,8H2,2-4H3
charge 0 multiplicity 1
35 atoms
O  0.974384 -0.648358 -0.613647
O  -3.209783 -2.661937 -1.357697
O  2.000719 -0.162555 1.435602
C  -0.271343 -1.050383 0.11449
C  -0.873971 -2.299444 -0.551002
C  -1.333035 0.04074 -0.019299
C  -2.495524 -0.456323 -0.559088
C  -2.322149 -1.899931 -0.885649
C  -3.807879 0.255588 -0.818275
C  -1.040928 1.441965 0.42903
C  -4.569362 0.576988 0.459313
C  2.070425 -0.226632 0.178848
C  3.200711 0.090657 -0.712541
C  4.443779 0.526755 -0.326943
C  -5.024848 1.806825 0.806037
C  5.498111 0.809879 -1.379312
C  4.875104 0.756529 1.105211
H  0.009193 -1.19534 1.175147
H  -0.853528 -3.197773 0.088572
H  -0.330457 -2.540019 -1.481738
H  -3.645112 1.185316 -1.395067
H  -4.423776 -0.422147 -1.44342
H  -0.62707 1.443771 1.455406
H  -1.937985 2.079972 0.406953
H  -0.264493 1.896688 -0.217132
H  -4.758782 -0.279023 1.123932
H  2.984395 -0.050157 -1.777103
H  -5.584715 1.970488 1.733467
H  -4.861153 2.683462 0.165878
H  5.835224 1.863108 -1.315954
H  5.133806 0.621366 -2.402717
H  6.395694 0.184248 -1.206609
H  4.065703 0.560577 1.821755
H  5.230755 1.798326 1.229943
H  5.737091 0.103473 1.347107
