program: Gaussian 09
title: 000225864
version: EM64L-G09RevD.01
frameworkgroup: C1[X(C13H18O3)]
method: RPBEPBE
basis: SDD
operation: Freq
keyword: #pfreq=noraman
keyword: PBEPBE/SDD
title: #p freq=noraman PBEPBE/SDD
converged: YES YES NO NO
title: Mulliken charges:
elementType: O O O C C C C C C C C C C C C C H H H H H H H H H H H H H H H H H H
charge: -0.462508 -0.270539 -0.267526 0.350188 -0.300468 -0.437835 -0.764084 -0.736023 0.505586 -0.734122 -0.452261 -0.440289 0.186588 0.157445 -0.347237 -0.202851 0.217158 0.217473 0.204307 0.213346 0.203144 0.246337 0.224912 0.231250 0.204897 0.228289 0.222752 0.222589 0.286098 0.233665 0.342539 0.248525 0.234092 0.234567
chargesum: 0.00000
title: Mulliken charges with hydrogens summed into heavy atoms:
elementType: O O O C C C C C C C C C C C C C
charge: -0.119969 -0.270539 -0.267526 0.350188 -0.083311 -0.016056 -0.101256 -0.074965 0.505586 -0.060492 -0.166163 -0.206624 0.186588 0.157445 -0.098712 0.265807
polarizability: 2.07382130e+02 4.53905161e+00 1.38744621e+02 -9.00769388e+00 -2.80693521e+00 1.01875008e+02
1716.lowfreq: -49.6232 -32.2401 -10.4574 -5.9833 -0.0002 0.0002 0.0005 31.9211 53.7307
frequency: -49.3178 31.7554 53.3962 60.9367 86.3958 172.9940 177.7048 188.2532 193.4194 219.5395 223.4104 238.7498 251.5263 263.1025 311.2377 319.8992 349.0914 360.4565 406.6186 422.2391 446.3745 464.6953 514.9904 566.6150 602.5267 621.9789 678.9645 714.2465 738.1355 755.3270 773.4566 785.7199 814.5169 841.1438 856.0920 892.1609 917.6656 921.1866 928.9562 936.2790 975.5429 980.3334 996.3720 1015.5086 1039.8462 1054.5982 1057.3171 1067.0770 1119.2226 1122.6044 1143.3870 1167.0510 1202.9580 1207.9820 1222.5592 1252.1439 1263.2465 1279.8036 1298.2204 1331.9718 1358.8073 1368.5173 1375.3173 1393.0773 1397.6279 1406.9828 1439.8552 1456.1501 1469.9969 1474.6806 1476.5372 1477.4358 1481.6401 1487.6031 1488.8301 1494.6402 1610.3566 1630.3813 2947.3765 2958.8774 2972.6023 2976.0368 2978.2885 3007.6947 3011.3897 3061.1461 3061.9579 3069.5503 3076.3469 3080.4260 3083.7838 3084.9369 3136.8333 3179.4574 3195.5953 3573.6539
redmass: 2.3550 3.6743 4.1013 4.7248 1.8693 3.6537 3.4610 1.3417 1.8947 1.4050 5.5528 1.1367 1.4188 2.1718 5.9534 2.6051 2.4482 3.2195 3.0466 3.7382 3.1087 3.0577 3.6503 4.9943 5.8381 5.3100 9.4974 4.6704 2.5215 3.2023 1.7297 3.6697 1.4494 7.4500 2.3678 1.4612 2.4353 2.5319 1.4042 1.4528 2.6272 5.2357 1.7202 1.5963 1.5291 3.0797 2.3128 1.4564 1.0396 1.5659 1.4167 1.9323 1.8041 1.8182 3.0242 2.3633 1.5250 1.2463 1.3915 1.5061 1.7371 1.4340 1.2108 1.2164 1.2397 2.4891 4.7814 1.0588 1.0695 1.0549 1.1297 2.0187 1.0668 1.0657 1.2347 1.0620 7.9603 8.2916 1.0830 1.0630 1.0360 1.0376 1.0368 1.0534 1.0970 1.0982 1.0986 1.0987 1.0993 1.0989 1.1188 1.0989 1.0895 1.0954 1.0930 1.0654
irintensity: 13.7380 0.4370 0.1911 0.0773 0.2261 3.7379 0.4305 0.5810 0.5618 2.0461 0.1841 0.4050 120.1190 9.8393 1.0075 1.9670 8.5246 0.8776 7.1197 4.5489 0.5098 4.0185 7.8819 9.3895 7.1939 5.3536 1.3287 0.3482 5.3623 24.3548 20.7779 5.2427 39.2827 29.6057 6.8204 20.6971 4.3985 16.8520 0.9022 5.8344 30.3017 152.1175 31.7408 13.0479 3.8172 13.9562 13.8832 4.3172 0.2445 22.3710 19.4204 13.9934 13.3756 31.5799 22.2399 118.7967 78.9463 2.5657 4.0516 1.1968 32.6697 10.7167 22.3922 27.2465 19.1773 3.3430 71.9321 1.5413 13.8879 10.0790 19.8543 107.5283 10.7752 15.4227 12.8129 18.0363 4.9353 0.5560 33.1484 41.7914 20.4785 50.5629 12.2675 137.7778 14.1581 27.8020 51.0662 52.5088 36.0614 29.7838 35.8416 47.0489 11.3016 5.5568 1.0640 2.9643
temp: 298.150 k
press: 1.00000 atm
elementType: 8 8 8 6 6 6 6 6 6 6 6 6 6 6 6 6 1 1 1 1 1 1 1 1 1 1 1 1 1 1 1 1 1 1
symmnumber: 1
zpe: 739554.7 jmol-1
zpe.correction: 0.281682 hartree
zpe.thermalcorrener: 0.297593 hartree
zpe.thermalcorrenthalpy: 0.298537 hartree
zpe.thermalcorrgfe: 0.238645 hartree
zpe.sumelectzpe: -730.592177 hartree
zpe.sumelectthermal: -730.576266 hartree
zpe.sumelectthermalent: -730.575322 hartree
zpe.sumelectthermalfe: -730.635214 hartree
dipole: 1.8732 0.7777 0.6418
dipole: 2.1274
quadrupole: -80.3950 -97.2780 -98.8414
quadrupole: 2.3225 -2.6966 -1.6617
quadrupole: 11.7764 -5.1065 -6.6699 2.3225 -2.6966 -1.6617
hfenergy: -730.8738589 hartree
pointgroup: C01 [X(C13H18O3)]
dipole: 0.7343099 0.2811441 0.2868408 debye
polarizability: 206.9618668|7.1523266|139.0388894|-9.3012084|2.3029953|102.0010021 unknown
InChI: InChI=1S/C13H18O3/c1-4-13(2,3)12(14)9-5-6-10-11(7-9)16-8-15-10/h5-7,12,14H,4,8H2,1-3H3
charge 0 multiplicity 1
34 atoms
O  1.713837 -1.102798 -1.572667
O  -3.147797 -1.560849 -0.032974
O  -4.006136 0.661485 0.297309
C  2.500288 -0.116071 0.609065
C  1.608869 0.072387 -0.682746
C  3.975861 -0.437178 0.186361
C  2.46995 1.184248 1.452903
C  1.984101 -1.29936 1.465723
C  0.120893 0.274421 -0.42158
C  4.660906 0.556949 -0.781088
C  -0.751083 -0.852969 -0.372292
C  -0.397476 1.581107 -0.242705
C  -2.09984 -0.606023 -0.122668
C  -2.605986 0.696213 0.071189
C  -1.776693 1.817605 0.013878
C  -4.383925 -0.776538 0.222047
H  1.991998 0.973234 -1.209664
H  4.575783 -0.489747 1.116574
H  4.016687 -1.461158 -0.241379
H  3.14226 1.083695 2.325562
H  2.799522 2.067185 0.872832
H  1.452923 1.389341 1.829651
H  1.895073 -2.21549 0.853658
H  0.993453 -1.081552 1.901464
H  2.685613 -1.504125 2.29648
H  4.701167 1.576366 -0.357354
H  4.149073 0.625289 -1.760003
H  5.701308 0.24073 -0.980494
H  -0.367542 -1.857738 -0.557229
H  0.277135 2.441571 -0.314916
H  2.661275 -1.216093 -1.836107
H  -2.172181 2.827607 0.146422
H  -4.812908 -1.085426 1.191129
H  -5.082512 -0.919722 -0.62108
