program: Gaussian 09
title: 000225894
version: EM64L-G09RevD.01
frameworkgroup: C1[X(C22H30O4)]
method: RPBEPBE
basis: SDD
operation: Freq
keyword: #pfreq=noraman
keyword: PBEPBE/SDD
title: #p freq=noraman PBEPBE/SDD
converged: YES YES NO NO
title: Mulliken charges:
elementType: O O O O C C C C C C C C C C C C C C C C C C C C C C H H H H H H H H H H H H H H H H H H H H H H H H H H H H H H
charge: -0.289979 -0.275660 -0.258512 -0.233857 -0.378272 -0.374082 -0.376518 -0.378671 -0.385489 -0.373261 -0.517148 -0.200859 -0.460166 0.577538 0.264120 -0.529561 -0.492092 -0.447366 0.200456 0.159101 -0.032221 -0.323251 -0.013390 -0.211763 -0.601878 -0.594214 0.191033 0.191999 0.195132 0.197095 0.199995 0.221794 0.188150 0.203569 0.214282 0.206814 0.201664 0.190667 0.231900 0.229779 0.268025 0.204789 0.201075 0.224713 0.224018 0.263700 0.245811 0.213581 0.252156 0.237692 0.240235 0.240619 0.215395 0.216362 0.217367 0.217585
chargesum: 0.00000
title: Mulliken charges with hydrogens summed into heavy atoms:
elementType: O O O O C C C C C C C C C C C C C C C C C C C C C C
charge: -0.289979 -0.275660 -0.258512 -0.233857 0.004760 0.018146 0.045271 0.013048 0.035607 0.019070 -0.055470 0.067166 -0.054302 0.577538 0.264120 -0.080830 -0.228393 -0.201555 0.200456 0.159101 0.181360 -0.071095 0.224302 0.269091 -0.170121 -0.159262
polarizability: 3.22200642e+02 2.92040540e+01 2.31118881e+02 1.69911611e+00 -6.71875952e+00 1.95524847e+02
1716.lowfreq: -58.5256 -11.2278 -5.5924 -0.0010 -0.0008 -0.0005 0.9703 5.5434 12.3596
frequency: -58.4698 -10.8871 11.9247 14.4148 21.6660 34.1541 44.8876 50.8665 52.7440 61.7358 66.3809 80.4272 86.2579 96.4918 113.4814 134.7498 140.1157 147.3007 155.2847 165.0381 188.4106 212.1738 217.1220 251.3777 258.2391 275.6341 288.9324 335.8309 356.3166 375.9357 396.7008 411.0699 419.6398 453.1920 462.9565 481.2468 492.4004 546.8819 580.5545 594.2182 627.3918 636.6533 652.5563 655.4185 680.0225 716.8187 722.2605 727.7744 754.3516 760.4324 780.2091 793.7392 810.5677 820.5086 840.5160 861.2075 865.4229 866.0972 903.1285 917.2841 918.4859 923.0214 939.8895 940.3372 944.7498 957.5517 966.7172 978.4694 986.9629 1003.8212 1007.7167 1013.4985 1020.2330 1036.0253 1049.6648 1054.6589 1060.7377 1063.3095 1067.9132 1079.3973 1081.8524 1105.4409 1120.2636 1121.7274 1147.2785 1168.0192 1172.8103 1185.1193 1202.3065 1212.5045 1215.6715 1226.6999 1249.6703 1251.0843 1252.8393 1259.2014 1272.5434 1273.2303 1281.3755 1285.0445 1287.1459 1291.8935 1295.7668 1305.4463 1309.3957 1316.9244 1326.8459 1336.8369 1346.7567 1358.0490 1364.7048 1365.9720 1412.0793 1425.1119 1425.2027 1443.1418 1447.8424 1448.2203 1456.9231 1458.8551 1461.4389 1462.4365 1468.4706 1476.1545 1478.7207 1484.7593 1486.9477 1609.6482 1630.0701 1638.3813 1656.8466 1658.4819 2950.8928 2951.6717 2952.5116 2957.2922 2964.0483 2967.6602 2979.2406 2984.0272 2986.1592 2993.0236 3002.9591 3004.3394 3011.2159 3016.6375 3028.4741 3039.1401 3040.9121 3051.6110 3055.2026 3071.2893 3080.0075 3085.1910 3088.9256 3089.6251 3107.3307 3150.1132 3167.6233 3183.7510 3192.7199 3194.8943
redmass: 2.6532 3.5485 3.4094 4.9297 3.7620 4.7379 5.1215 3.8953 2.9566 3.2555 4.7206 1.9347 3.5212 2.8328 2.5466 1.8586 3.2017 2.5836 3.6208 2.5446 4.1309 3.1155 5.5229 4.4247 3.5926 3.3505 4.9374 2.7792 3.9099 3.1896 2.7870 3.6380 2.8458 3.1813 2.5585 2.3934 3.1552 4.9683 4.6913 4.4041 3.6786 1.5390 2.4887 2.3461 8.7954 1.0676 3.2745 1.1774 1.3324 3.9524 4.0539 4.5902 1.4292 1.3796 9.7668 3.1789 1.6256 1.5939 1.5749 1.9116 1.9196 3.5457 1.3925 1.3440 1.4050 2.2200 1.8441 4.4348 2.1786 1.2200 2.5227 1.1508 2.4821 2.2698 1.8946 1.9607 3.5799 1.4606 2.4427 2.4935 2.5825 2.2605 1.6626 1.0465 1.7868 1.6964 1.8938 1.6830 1.7098 1.4719 1.3929 1.4205 1.9042 2.1708 1.3088 1.2965 1.1859 1.2545 1.1859 1.2191 1.1587 1.1284 1.2195 1.1936 1.2706 1.2982 1.3790 1.7829 1.4832 1.6418 1.5576 1.2760 2.7934 1.1824 1.1731 3.3230 1.1052 1.1895 1.0886 1.0862 1.0932 1.0625 1.1052 1.9455 1.1608 1.1586 1.2572 7.8045 8.2550 10.6717 4.7402 4.7636 1.0591 1.0604 1.0596 1.0599 1.0596 1.0591 1.0622 1.0664 1.0907 1.0973 1.0622 1.0992 1.0537 1.1013 1.1029 1.0882 1.1038 1.1038 1.0951 1.0782 1.0997 1.0601 1.0750 1.1185 1.0939 1.0899 1.0929 1.0960 1.1144 1.1142
irintensity: 14.7163 0.0539 0.2542 0.1605 0.1593 0.4695 0.4247 0.1530 0.4830 0.3384 1.6426 0.1076 0.4634 0.1301 0.1496 0.0944 0.2369 0.5333 0.5124 1.7276 1.1915 0.3230 0.7900 1.1426 2.5346 3.2559 1.9109 1.6614 0.5365 1.6629 1.0230 4.6141 1.8621 13.1815 0.4698 7.1042 2.6656 7.9255 9.3253 2.3962 8.7967 17.0622 3.7743 27.6537 1.6627 16.4415 8.9575 0.8173 2.9741 14.0458 9.6729 2.7171 5.3122 37.3414 31.6890 16.1098 5.2301 26.0046 24.9954 2.4994 31.1903 45.4514 11.7555 101.3874 61.9645 33.2860 35.9715 106.6748 1.0638 25.5319 1.1661 27.5015 16.3659 83.8319 12.6665 6.9521 10.4706 6.0732 11.4418 2.2150 1.5085 36.9668 15.1702 0.4309 3.5039 36.3019 10.9305 10.2293 107.6964 7.4633 5.0462 34.3027 103.2699 118.3652 16.7416 7.9584 3.6713 2.4973 1.3649 1.0191 3.2918 0.4332 1.1796 1.7292 4.6226 1.8769 2.9701 27.0059 1.4711 0.2604 1.0972 1.4236 7.6451 3.5789 3.6428 65.0082 16.3986 19.8487 2.9170 1.6476 1.2491 7.5762 3.7530 78.3081 10.5584 26.7611 21.1850 6.0399 2.9937 153.8746 20.7739 16.5060 0.0440 4.9993 4.6695 0.5811 25.9885 136.4373 17.8308 38.8452 14.2882 1.0302 28.5764 2.6348 109.7833 0.7275 3.0390 3.5794 131.2861 131.0141 16.6094 43.2557 34.6174 12.7866 7.0221 31.9571 12.6123 4.9298 1.6747 3.5561 34.0141 28.7244
temp: 298.150 k
press: 1.00000 atm
elementType: 8 8 8 8 6 6 6 6 6 6 6 6 6 6 6 6 6 6 6 6 6 6 6 6 6 6 1 1 1 1 1 1 1 1 1 1 1 1 1 1 1 1 1 1 1 1 1 1 1 1 1 1 1 1 1 1
symmnumber: 1
zpe: 1231261.9 jmol-1
zpe.correction: 0.468963 hartree
zpe.thermalcorrener: 0.495849 hartree
zpe.thermalcorrenthalpy: 0.496794 hartree
zpe.thermalcorrgfe: 0.406865 hartree
zpe.sumelectzpe: -1155.188367 hartree
zpe.sumelectthermal: -1155.161481 hartree
zpe.sumelectthermalent: -1155.160536 hartree
zpe.sumelectthermalfe: -1155.250465 hartree
dipole: -0.8315 0.2932 -1.7028
dipole: 1.9175
quadrupole: -157.1702 -147.0564 -164.5283
quadrupole: -1.3087 -6.2122 -0.9599
quadrupole: -0.9186 9.1952 -8.2767 -1.3087 -6.2122 -0.9599
hfenergy: -1155.65733 hartree
pointgroup: C01 [X(C22H30O4)]
dipole: -0.3520411 0.1790658 -0.6427483 debye
polarizability: 316.5176234|36.1829355|238.0939578|4.4912387|-1.3602847|194.2327893 unknown
InChI: InChI=1S/C22H30O4/c1-3-5-6-7-8-9-10-11-13-22(23)26-19(12-4-2)18-14-15-20-21(16-18)25-17-24-20/h3-4,14-16,19H,1-2,5-13,17H2
charge 0 multiplicity 1
56 atoms
O  2.980815 1.353767 -0.148392
O  -1.353446 -1.587062 -1.306324
O  -1.39919 -3.234803 0.443979
O  3.1116 1.389717 2.182733
C  -1.444684 2.609309 -0.019904
C  -2.54631 1.716364 0.59358
C  -0.153641 2.64119 0.828049
C  -3.807414 1.605452 -0.291737
C  0.980724 3.456478 0.168247
C  -4.88705 0.675943 0.305197
C  2.3189 3.388802 0.952777
C  3.353876 -0.109873 -0.14893
C  -6.147137 0.552458 -0.59296
C  2.104314 -0.951899 0.051024
C  2.838177 1.967109 1.106596
C  4.054765 -0.346208 -1.505913
C  0.9839 -0.777592 -0.817604
C  2.060846 -1.911829 1.090016
C  -0.127492 -1.58708 -0.592489
C  -0.158069 -2.552576 0.437584
C  -7.202146 -0.358459 -0.001796
C  0.923973 -2.740446 1.299335
C  5.331465 0.452727 -1.661847
C  -2.195245 -2.630338 -0.658837
C  -7.725406 -1.455208 -0.606571
C  6.549195 -0.07949 -1.933446
H  -1.200178 2.231995 -1.035089
H  -1.831911 3.64117 -0.15419
H  -2.130789 0.70069 0.761188
H  -2.827413 2.107307 1.593761
H  -0.374472 3.053615 1.834185
H  0.18908 1.598724 0.987158
H  -4.239842 2.615886 -0.44982
H  -3.514567 1.229318 -1.293846
H  1.152824 3.083713 -0.859205
H  0.678616 4.519026 0.081037
H  -5.184995 1.047875 1.307406
H  -4.45876 -0.335019 0.467526
H  2.203637 3.80333 1.969092
H  3.085885 3.98708 0.423915
H  4.057485 -0.274802 0.686629
H  -5.855595 0.188162 -1.597645
H  -6.572889 1.569041 -0.734058
H  4.263155 -1.428306 -1.599947
H  3.341823 -0.081668 -2.312965
H  0.988272 -0.022225 -1.608069
H  2.918055 -2.007136 1.764543
H  -7.551206 -0.09062 1.008984
H  0.890111 -3.478332 2.104346
H  5.227059 1.540838 -1.543211
H  -2.432348 -3.41197 -1.400576
H  -3.0955 -2.153151 -0.233338
H  -8.486304 -2.074979 -0.118642
H  -7.40977 -1.760581 -1.61252
H  7.439492 0.550372 -2.040639
H  6.691928 -1.160706 -2.057277
