program: Gaussian 09
title: 000225865
version: EM64L-G09RevD.01
frameworkgroup: C1[X(C13H18O3)]
method: RPBEPBE
basis: SDD
operation: Freq
keyword: #pfreq=noraman
keyword: PBEPBE/SDD
title: #p freq=noraman PBEPBE/SDD
converged: YES YES NO NO
title: Mulliken charges:
elementType: O O O C C C C C C C C C C C C C H H H H H H H H H H H H H H H H H H
charge: -0.250690 -0.453865 -0.254639 -0.369230 -0.345902 -0.262908 -0.297983 0.380367 0.215344 -0.362365 -0.380204 -0.685409 0.438061 -0.393173 -0.372949 -0.806754 0.209557 0.210695 0.198375 0.198910 0.229561 0.229538 0.260778 0.246918 0.264606 0.212836 0.212719 0.220919 0.227821 0.228926 0.225400 0.222682 0.235981 0.366078
chargesum: 0.00000
title: Mulliken charges with hydrogens summed into heavy atoms:
elementType: O O O C C C C C C C C C C C C C
charge: -0.250690 -0.087788 -0.254639 0.051022 0.051382 0.196190 -0.037205 0.380367 0.215344 -0.115447 -0.115598 -0.038935 0.438061 -0.165351 -0.144023 -0.122691
polarizability: 1.81548993e+02 -6.37646086e+00 1.61120376e+02 1.39513563e+01 8.03045411e+00 1.05579621e+02
1716.lowfreq: -21.1434 -7.3272 -0.0006 0.0005 0.0009 3.5635 6.3946 17.0873 28.5337
frequency: -20.9277 16.9143 28.4446 49.5764 61.0642 72.7726 84.8123 108.5561 129.9210 177.5571 202.5664 208.3104 242.2187 245.2593 304.2876 328.3452 332.2298 384.0847 401.9110 408.1831 425.5691 458.8831 504.1189 558.8256 630.1734 640.7734 701.8827 725.3451 741.1892 778.0652 798.1711 807.2957 849.4326 856.5360 869.8411 907.1836 916.5633 933.1420 958.3771 981.5193 986.2550 1012.8199 1025.0674 1041.1642 1046.6582 1080.1663 1122.3749 1125.5637 1146.7104 1161.4362 1173.2483 1195.8826 1213.0809 1220.7641 1228.3584 1268.1681 1272.7338 1274.6409 1289.4182 1309.7175 1344.1099 1360.0911 1371.9831 1385.6101 1394.0769 1396.1116 1403.7638 1468.5085 1471.6230 1472.5168 1473.8274 1479.2685 1480.6796 1491.1728 1502.8466 1586.2795 1613.9694 1623.5465 2971.8030 2974.6203 2978.0077 2993.5621 3008.0281 3015.5468 3028.5562 3048.9357 3055.5092 3073.8235 3079.2035 3083.8083 3084.3360 3117.9917 3121.5989 3145.3946 3165.5439 3455.7809
redmass: 1.0150 3.9148 3.5483 2.4200 6.6929 2.6428 3.6151 2.2701 3.3933 4.0722 4.1551 4.0709 1.2280 3.9792 5.3614 4.0313 3.7662 2.6200 2.6498 3.1475 1.3640 4.7332 2.8862 5.3759 6.5878 6.7351 4.1912 4.0445 1.0701 3.0006 1.1488 2.3140 1.9050 1.9517 3.3096 2.7308 3.1016 1.1700 1.3682 1.3866 1.4301 3.1454 4.0286 3.3427 1.5678 2.2550 1.3048 2.6196 1.4732 2.7810 1.9507 1.3367 1.3502 2.9196 1.7519 1.3470 1.2417 1.2191 1.0789 1.2823 1.4177 1.7839 1.7561 2.1699 1.2192 1.2261 2.9295 1.0823 1.0766 1.0689 1.0710 1.0419 1.0623 1.0907 2.6113 6.3360 8.8309 6.6368 1.0588 1.0384 1.0366 1.0598 1.0566 1.1005 1.0843 1.1036 1.0952 1.1022 1.0994 1.0997 1.1075 1.0880 1.0895 1.0958 1.0938 1.0649
irintensity: 0.5369 0.2064 0.1232 0.8839 0.7860 0.0990 0.1780 0.2836 3.3141 0.1152 5.6883 1.9469 0.6588 9.9683 9.6808 16.4770 4.7397 20.9563 17.8589 11.0273 91.1752 10.4372 29.9618 2.5504 6.2391 5.2056 13.4665 15.3155 9.3462 17.3252 0.4360 20.3187 1.5464 2.9504 35.7386 9.0793 16.6750 0.2837 0.9775 0.2837 4.2264 18.7811 117.8709 40.4556 21.0895 19.4989 3.6003 3.4377 3.0181 285.6014 17.5794 6.1722 0.3634 27.8264 140.9697 3.9904 4.6960 3.2513 0.1235 2.2947 1.6930 20.8175 7.1713 29.6372 6.5893 10.1852 4.7589 1.0202 13.4914 0.6305 14.3591 13.5466 5.7396 19.7804 39.8625 0.3395 148.8020 27.3151 27.3066 37.4440 29.6204 19.8344 32.0415 6.2303 12.8091 4.4512 22.9721 24.6508 47.7720 18.9700 90.7222 13.9690 21.4438 14.4474 4.7512 41.7925
temp: 298.150 k
press: 1.00000 atm
elementType: 8 8 8 6 6 6 6 6 6 6 6 6 6 6 6 6 1 1 1 1 1 1 1 1 1 1 1 1 1 1 1 1 1 1
symmnumber: 1
zpe: 740166.4 jmol-1
zpe.correction: 0.281915 hartree
zpe.thermalcorrener: 0.298678 hartree
zpe.thermalcorrenthalpy: 0.299622 hartree
zpe.thermalcorrgfe: 0.234858 hartree
zpe.sumelectzpe: -730.633087 hartree
zpe.sumelectthermal: -730.616324 hartree
zpe.sumelectthermalent: -730.615380 hartree
zpe.sumelectthermalfe: -730.680144 hartree
dipole: -2.2872 -3.1661 0.3337
dipole: 3.9200
quadrupole: -82.3213 -99.4390 -98.7664
quadrupole: -3.8129 4.5666 0.9246
quadrupole: 11.1876 -5.9301 -5.2575 -3.8129 4.5666 0.9246
hfenergy: -730.9150016 hartree
pointgroup: C01 [X(C13H18O3)]
dipole: 0.8535754 1.2837348 -0.0445798 debye
polarizability: 179.5015021|-7.7657|158.8366394|-18.7329579|-12.5244331|109.9108481 unknown
InChI: InChI=1S/C13H18O3/c1-3-4-9-16-13(15)12(14)11-7-5-10(2)6-8-11/h5-8,12,14H,3-4,9H2,1-2H3
charge 0 multiplicity 1
34 atoms
O  1.545146 -0.613291 -0.35983
O  -1.130745 -3.056623 -0.064141
O  1.074138 -2.20072 1.282334
C  3.525478 0.800167 -0.505671
C  4.891509 1.202428 0.101504
C  2.846279 -0.290979 0.318878
C  -0.589849 -1.770258 -0.475102
C  -1.548848 -0.602799 -0.17359
C  0.755034 -1.562241 0.247724
C  -1.301293 0.69225 -0.691024
C  -2.702086 -0.818288 0.614209
C  5.59457 2.304684 -0.719058
C  -3.35022 1.550066 0.379653
C  -2.191488 1.752165 -0.414362
C  -3.586044 0.248106 0.889822
C  -4.324875 2.684304 0.647909
H  2.863769 1.686012 -0.557746
H  3.668604 0.440371 -1.542604
H  5.547168 0.310122 0.160404
H  4.74505 1.552934 1.143194
H  3.445525 -1.21878 0.366666
H  2.622338 0.034885 1.351106
H  -0.399363 -1.819453 -1.562415
H  -0.408164 0.873958 -1.29985
H  -2.90639 -1.826892 0.985668
H  5.779541 1.970031 -1.756885
H  4.975978 3.220311 -0.766175
H  6.56809 2.576719 -0.272866
H  -1.986283 2.749799 -0.822018
H  -4.476411 0.064393 1.504112
H  -4.775871 2.601528 1.652827
H  -3.831751 3.669522 0.574449
H  -5.155333 2.676177 -0.08487
H  -0.685801 -3.303208 0.79435
