program: Gaussian 09
title: 000225868
version: EM64L-G09RevD.01
frameworkgroup: C1[X(C13H23NO3)]
method: RPBEPBE
basis: SDD
operation: Freq
keyword: #p
keyword: freq=noraman
keyword: PBEPBE/SDD
title: #p freq=noraman PBEPBE/SDD
converged: YES YES NO NO
title: Mulliken charges:
elementType: O O O N C C C C C C C C C C C C C H H H H H H H H H H H H H H H H H H H H H H H
charge: -0.321741 -0.279473 -0.251707 -0.139299 0.287243 -0.481771 -0.485111 -0.418528 -0.390298 -0.386541 0.193357 -0.332668 -0.352015 0.294151 -0.670976 -0.669155 -0.773896 0.240094 0.222412 0.201127 0.260961 0.188468 0.261850 0.213672 0.195675 0.201953 0.192567 0.258671 0.199112 0.238016 0.213330 0.205675 0.216121 0.253765 0.211608 0.247139 0.212639 0.246103 0.250644 0.246825
chargesum: 0.00000
title: Mulliken charges with hydrogens summed into heavy atoms:
elementType: O O O N C C C C C C C C C C C C C
charge: -0.321741 -0.279473 -0.251707 -0.139299 0.287243 -0.019264 -0.023024 0.031791 0.019049 0.007979 0.193357 0.125115 0.099332 0.294151 0.004585 0.002232 -0.030325
polarizability: 1.67137635e+02 -2.79960140e+00 1.69885982e+02 -1.66163993e+00 3.25732404e+00 1.26388126e+02
1716.lowfreq: -17.4404 0.0007 0.0011 0.0012 2.8973 10.2385 44.7416 53.8309 61.9148
frequency: 44.5147 53.7797 61.8797 73.7072 79.3289 95.8234 110.6094 113.1748 142.2109 148.9869 171.4341 212.7301 227.3453 228.4879 258.8368 273.0873 294.1284 305.0010 328.5793 354.8634 358.6386 399.4413 433.6364 441.1816 491.6275 504.4790 526.4323 543.8827 567.0586 630.2774 675.8612 701.3165 763.9507 777.4303 784.1199 791.7254 834.9921 853.1828 867.7698 910.8637 912.4438 936.4134 939.1378 947.6579 993.4842 1003.5236 1022.4868 1038.9505 1049.9310 1067.9197 1080.2929 1082.2583 1099.3231 1106.9512 1125.1919 1142.1521 1171.5122 1195.7227 1205.1086 1217.7756 1250.5377 1257.4883 1279.3055 1301.1953 1302.0113 1321.2721 1336.4404 1343.7550 1347.1564 1349.3423 1354.6249 1363.1226 1379.8740 1382.0516 1385.1177 1411.6456 1450.5084 1452.7960 1453.8335 1455.3598 1466.4687 1467.2057 1468.8536 1469.9284 1474.5838 1478.3544 1483.1631 1485.0293 1488.9969 1556.6657 1638.6458 2969.1944 2978.9847 2983.5589 2984.2257 2987.4889 2995.5220 3004.9765 3012.3865 3015.0615 3017.4282 3032.3472 3039.5081 3068.2181 3069.4964 3073.9471 3076.9299 3084.5636 3084.8399 3095.8670 3102.1087 3103.5099 3129.0938 3138.5281
redmass: 3.1589 2.9488 1.7071 2.3283 3.1401 2.6973 3.4983 4.1562 3.4667 3.4266 2.2743 1.1735 1.2150 4.8225 2.1238 2.6287 2.5948 3.0330 2.9022 2.2538 2.5647 3.0216 3.3198 3.3086 2.6873 2.9035 3.6987 2.4301 3.1935 3.6802 6.0351 6.7911 1.7442 1.3408 1.3746 1.4020 3.5610 2.4403 2.0480 4.3226 2.3359 2.1107 1.4383 2.0925 2.0147 2.4933 2.6404 1.6537 2.0190 2.0902 1.4831 1.8209 1.8295 1.9799 1.7947 1.5807 2.3318 3.6650 2.8749 2.0481 1.4307 1.3686 1.2460 1.5913 1.2640 1.3030 1.3564 1.3394 1.3725 1.2756 1.3547 1.3167 1.2247 1.2218 1.2174 2.3492 1.1490 1.0678 1.0647 1.0727 1.0715 1.0711 1.0771 1.0506 1.1361 1.0815 1.0996 1.0493 1.0640 5.1439 9.0475 1.0621 1.0617 1.0523 1.0408 1.0497 1.0648 1.0372 1.0612 1.0613 1.0606 1.0951 1.1013 1.0996 1.1004 1.0986 1.1025 1.1000 1.1019 1.0961 1.0988 1.1016 1.0923 1.1014
irintensity: 0.5891 0.0921 2.1650 1.3065 3.5261 0.1245 0.8627 1.5842 1.0982 0.9097 0.7858 0.1245 0.5876 8.3024 0.3766 2.1354 0.1411 2.1720 0.5889 3.9498 4.9808 8.7703 0.8904 1.0074 8.3262 2.1238 12.4449 2.8216 4.1975 6.2252 12.3669 6.3428 3.6276 0.3417 1.1819 23.0088 8.2218 25.1531 12.0534 94.8154 10.0965 8.9412 1.7350 11.8992 97.1829 11.0628 14.6366 8.7703 2.3612 21.8816 7.9419 5.0170 14.7119 0.3485 51.2650 12.7986 82.5772 223.9833 50.5516 8.1609 48.7607 4.1425 4.2516 10.3566 11.2211 2.6344 1.0014 1.9960 11.4119 7.9221 1.3875 7.3420 21.0283 4.8055 62.6205 68.6012 19.4199 35.1079 18.8291 11.4542 2.8966 5.3646 14.4955 8.8203 14.5784 20.0994 26.6141 6.2632 11.9422 192.0261 187.9484 33.0083 26.6917 8.5014 51.5596 39.4852 50.0100 3.1933 36.0148 19.2375 39.4697 49.7228 48.4825 15.2635 11.0293 30.2300 18.5498 38.7111 19.9368 10.6966 11.6998 42.2503 24.0827 10.5197
temp: 298.150 k
press: 1.00000 atm
elementType: 8 8 8 7 6 6 6 6 6 6 6 6 6 6 6 6 6 1 1 1 1 1 1 1 1 1 1 1 1 1 1 1 1 1 1 1 1 1 1 1
symmnumber: 1
zpe: 906038.0 jmol-1
zpe.correction: 0.345092 hartree
zpe.thermalcorrener: 0.364178 hartree
zpe.thermalcorrenthalpy: 0.365123 hartree
zpe.thermalcorrgfe: 0.298161 hartree
zpe.sumelectzpe: -788.260494 hartree
zpe.sumelectthermal: -788.241407 hartree
zpe.sumelectthermalent: -788.240463 hartree
zpe.sumelectthermalfe: -788.307424 hartree
dipole: -2.2575 2.6387 1.6705
dipole: 3.8535
quadrupole: -105.5596 -97.8846 -105.9568
quadrupole: -3.9571 -6.1774 -4.1945
quadrupole: -2.4259 5.2491 -2.8232 -3.9571 -6.1774 -4.1945
hfenergy: -788.6055853 hartree
pointgroup: C01 [X(C13H23N1O3)]
dipole: 0.8413138 1.0772357 -0.6559569 debye
polarizability: 166.8905748|2.6735151|170.1572412|-2.0770575|-2.8192046|126.363927 unknown
InChI: InChI=1S/C13H23NO3/c1-4-14(5-2)12(16)13(17-11(3)15)9-7-6-8-10-13/h4-10H2,1-3H3
charge 0 multiplicity 1
40 atoms
O  -0.863472 1.24109 0.256221
O  1.195888 -1.356638 1.332694
O  -3.088319 1.230582 -0.520196
N  1.884407 0.361693 -0.044989
C  -0.608308 -0.256209 0.087994
C  -1.547813 -1.015698 1.061088
C  -0.831763 -0.71006 -1.3836
C  -1.535719 -2.55505 0.867927
C  -0.719183 -2.249769 -1.51836
C  -1.749243 -2.955901 -0.608532
C  0.887198 -0.429625 0.511904
C  3.28394 0.019101 0.336705
C  1.735092 1.529794 -0.945894
C  -2.102901 1.825498 -0.027529
C  3.858682 -1.120561 -0.5303
C  1.943758 2.878379 -0.22204
C  -2.075176 3.289662 0.369047
H  -2.572669 -0.643636 0.882068
H  -1.259276 -0.769153 2.097858
H  -0.108848 -0.218766 -2.059102
H  -1.847049 -0.399764 -1.687316
H  -2.333112 -2.992363 1.499799
H  -0.570208 -2.950628 1.226326
H  0.302983 -2.586816 -1.253406
H  -0.885361 -2.52399 -2.577906
H  -1.663864 -4.054337 -0.716804
H  -2.772432 -2.675638 -0.934255
H  3.285922 -0.285727 1.396635
H  3.895605 0.933042 0.233414
H  0.737121 1.521622 -1.402163
H  2.476802 1.419764 -1.762759
H  3.847714 -0.85654 -1.603929
H  4.90423 -1.332914 -0.240193
H  3.267252 -2.039994 -0.384135
H  1.842076 3.713528 -0.940203
H  1.189539 2.996985 0.573471
H  2.946864 2.94914 0.235535
H  -1.14355 3.773277 0.032222
H  -2.112949 3.37448 1.470241
H  -2.948359 3.802842 -0.059939
