program: Gaussian 09
title: 000225884
version: EM64L-G09RevD.01
frameworkgroup: C1[X(C18H18O7)]
method: RPBEPBE
basis: SDD
operation: Freq
keyword: #pfreq=noraman
keyword: PBEPBE/SDD
title: #p freq=noraman PBEPBE/SDD
converged: YES YES NO NO
title: Mulliken charges:
elementType: O O O O O O O C C C C C C C C C C C C C C C C C C H H H H H H H H H H H H H H H H H H
charge: -0.263191 -0.262351 -0.282897 -0.290154 -0.291507 -0.279255 -0.270647 0.529488 0.206934 0.168853 -0.475828 -0.492981 -0.403893 -0.334106 0.294556 -0.204245 0.065137 0.303419 0.267537 -0.500018 -0.523782 0.195991 -0.521409 -0.533568 -0.497869 0.298357 0.243842 0.222454 0.235323 0.250912 0.241368 0.233485 0.284255 0.293336 0.231259 0.269551 0.206386 0.232103 0.225614 0.242325 0.229705 0.203701 0.251810
chargesum: 0.00000
title: Mulliken charges with hydrogens summed into heavy atoms:
elementType: O O O O O O O C C C C C C C C C C C C C C C C C C
charge: -0.263191 -0.262351 -0.282897 -0.290154 -0.291507 -0.279255 -0.270647 0.529488 0.206934 0.168853 -0.177471 -0.026685 -0.168570 -0.083194 0.294556 0.270607 0.065137 0.303419 0.267537 -0.215763 -0.230446 0.195991 0.185787 0.166475 0.187347
polarizability: 2.92360600e+02 6.17900470e+00 2.37762464e+02 5.02127773e+00 -3.21153051e+00 1.68646747e+02
1716.lowfreq: -6.5704 -3.4159 -0.0008 -0.0007 -0.0005 1.3487 12.9023 15.9122 28.8204
frequency: 12.8199 15.9086 28.7933 43.4564 52.0491 73.5060 76.5313 86.6838 88.0135 93.9515 119.4893 145.2690 158.8706 186.2066 191.1465 208.5410 214.2804 221.6391 223.9062 246.3213 269.1285 282.4864 295.2045 310.6102 337.7255 351.4083 385.9926 413.6450 419.9598 427.4753 448.5068 491.8743 503.3178 531.4194 561.4720 579.5048 588.8170 619.8997 647.6102 678.0556 687.7242 717.3558 725.7482 729.9584 754.6183 755.5659 777.5651 810.2609 836.4610 839.5578 867.4313 869.8680 894.8844 909.9600 911.1657 917.4106 931.9551 946.7819 972.4069 985.7303 994.9183 1060.6348 1063.6508 1070.4234 1081.6579 1106.1725 1108.9456 1113.6804 1125.7516 1131.7976 1143.1391 1153.3333 1159.9556 1166.9234 1188.3270 1199.9045 1220.6889 1234.4361 1252.5462 1277.4388 1306.4648 1350.7402 1363.9534 1385.3806 1402.1062 1404.7451 1419.3108 1440.9223 1442.5775 1444.5668 1451.8948 1454.1886 1458.0712 1466.1815 1466.6802 1470.9209 1475.6176 1480.1348 1483.2466 1485.4646 1574.2334 1602.0230 1608.4085 1615.3180 1628.2466 2966.8573 2971.2543 2976.5697 3001.8015 3036.1903 3058.2245 3085.8244 3088.2469 3106.0090 3111.1917 3125.4853 3126.0593 3130.7132 3139.4646 3177.0721 3180.0125 3182.2238 3197.3032
redmass: 5.2420 6.0131 5.3222 3.1212 5.1669 2.6381 5.1255 2.1344 2.6023 3.6770 6.7161 1.8721 3.3897 1.9428 2.2499 3.7978 4.1503 5.7186 2.4493 3.7818 2.3481 2.8098 4.3869 4.5824 3.2691 6.1202 5.3424 4.1476 3.4652 6.1861 4.2815 6.8531 5.8356 6.3970 5.3006 5.0210 5.5564 5.5307 4.9444 9.0898 5.1045 5.2198 6.8194 4.5276 4.5178 4.5250 5.6826 1.8362 4.0519 7.7557 1.7433 4.3444 2.9884 2.0316 1.5631 3.5766 1.3931 8.8771 4.2900 6.1687 2.2825 3.6870 3.7304 1.4898 2.8698 1.2463 1.2427 1.2573 1.0730 1.3631 1.7315 1.4044 1.5215 3.1531 1.7129 2.1226 1.5353 1.2176 4.9825 1.3825 4.7360 1.3606 1.2703 4.6056 3.1199 3.8734 1.2778 1.2522 4.4717 1.3832 1.1641 1.1172 1.1443 1.2003 1.4265 1.0639 2.0876 1.3033 1.0635 1.3670 8.3683 6.7915 8.1407 9.9751 8.0924 1.0324 1.0363 1.0350 1.0599 1.0587 1.1042 1.0947 1.0962 1.1114 1.1072 1.1056 1.1004 1.1051 1.0901 1.0941 1.0921 1.0957 1.0907
irintensity: 0.5446 0.1848 0.1733 3.2903 7.2700 11.1020 3.2995 2.6596 2.2421 0.4901 5.6393 0.7788 5.3603 3.7139 1.9552 3.1051 1.6532 1.6744 1.0076 12.9900 0.3177 0.4593 5.8329 2.0520 20.2856 4.5582 3.3554 6.8889 5.7764 6.0674 14.4435 3.2514 9.7824 7.4880 1.2171 7.2104 1.2632 3.2214 14.2531 0.5788 13.1844 4.0439 10.4771 15.5578 28.8022 11.0133 17.2712 66.5778 2.5747 27.6184 19.8598 9.7844 100.3027 16.5873 39.3737 65.8029 5.9766 71.1761 107.1825 118.7567 112.3030 124.7335 181.1981 7.6818 52.8350 7.1114 26.8786 0.2610 0.5035 2.6778 110.1083 53.2113 47.4132 191.0931 13.0530 21.9511 82.7382 4.2132 252.5622 4.1783 392.2074 75.8209 1.0526 70.6174 80.5668 12.0447 9.6261 24.3695 68.4957 44.9685 32.4550 9.8837 55.0804 43.1475 67.1858 27.2225 74.3014 19.1102 15.1651 34.4959 179.3200 23.5692 26.7688 117.2421 2.4954 58.2185 67.4113 89.0199 118.5805 36.9375 39.4107 33.8863 51.8023 33.1054 5.8848 18.7803 22.9363 13.0982 9.8222 2.1302 2.3116 7.2551 3.2328
temp: 298.150 k
press: 1.00000 atm
elementType: 8 8 8 8 8 8 8 6 6 6 6 6 6 6 6 6 6 6 6 6 6 6 6 6 6 1 1 1 1 1 1 1 1 1 1 1 1 1 1 1 1 1 1
symmnumber: 1
zpe: 859338.2 jmol-1
zpe.correction: 0.327305 hartree
zpe.thermalcorrener: 0.351625 hartree
zpe.thermalcorrenthalpy: 0.352569 hartree
zpe.thermalcorrgfe: 0.269936 hartree
zpe.sumelectzpe: -1221.371858 hartree
zpe.sumelectthermal: -1221.347538 hartree
zpe.sumelectthermalent: -1221.346594 hartree
zpe.sumelectthermalfe: -1221.429227 hartree
dipole: -0.4722 3.1641 -4.1416
dipole: 5.2333
quadrupole: -132.8693 -129.9977 -140.3881
quadrupole: -1.2948 10.6089 9.5001
quadrupole: 1.5491 4.4206 -5.9697 -1.2948 10.6089 9.5001
hfenergy: -1221.6991631 hartree
pointgroup: C01[X(C18H18O7)]
dipole: 0.175775 -1.9815109 -0.5310133 debye
polarizability: 293.0567404|2.1798812|215.3996008|-2.1791044|-32.2287974|190.3134696 unknown
InChI: InChI=1S/C18H18O7/c1-20-15-7-12(8-16(21-2)17(15)22-3)18(19)23-9-11-4-5-13-14(6-11)25-10-24-13/h4-8H,9-10H2,1-3H3
charge 0 multiplicity 1
43 atoms
O  -4.688263 1.298868 -2.045957
O  -5.852309 -0.793735 -1.89326
O  -0.711062 0.118364 1.841481
O  5.358023 -0.440676 -0.188204
O  3.67771 -2.309908 1.01251
O  4.301165 2.207414 -0.805352
O  -0.453582 2.256627 0.933784
C  -3.117055 0.102504 1.163594
C  -4.267528 0.584089 -0.894444
C  -4.956136 -0.646883 -0.805896
C  -3.349772 0.993627 0.070716
C  -2.121031 0.481262 2.235569
C  -3.814563 -1.12904 1.247039
C  -4.755363 -1.528011 0.258533
C  1.387013 0.657559 0.813414
C  -5.563643 0.358921 -2.791182
C  4.014581 -0.129127 0.073174
C  3.131036 -1.044762 0.733785
C  3.549252 1.18999 -0.209949
C  1.825937 -0.662386 1.094179
C  2.242239 1.573757 0.169878
C  0.01849 1.116057 1.176582
C  5.642067 -1.628468 -1.024684
C  2.852765 -3.242602 1.786523
C  5.38198 1.89503 -1.757544
H  -2.812911 1.943282 -0.00026
H  -2.137743 1.563897 2.448225
H  -2.275973 -0.098376 3.158859
H  -3.621646 -1.796103 2.094757
H  -5.299008 -2.473425 0.326335
H  -6.509366 0.865987 -3.037395
H  -5.02341 -0.009357 -3.683435
H  1.142208 -1.348519 1.596161
H  1.897611 2.586708 -0.053509
H  6.739036 -1.659825 -1.108491
H  5.261809 -2.542438 -0.542581
H  5.188646 -1.508015 -2.028412
H  2.58571 -2.813681 2.770918
H  1.931557 -3.516728 1.237365
H  3.482936 -4.133325 1.925764
H  5.600342 2.858294 -2.244768
H  5.044392 1.161541 -2.515002
H  6.270959 1.507011 -1.237323
