program: Gaussian 09
title: 000225839
version: EM64L-G09RevD.01
frameworkgroup: C1[X(C10H13ClO)]
method: RPBEPBE
basis: SDD
operation: Freq
keyword: #p
keyword: freq=noraman
keyword: PBEPBE/SDD
title: #p freq=noraman PBEPBE/SDD
converged: YES YES NO NO
title: Mulliken charges:
elementType: Cl O C C C C C C C C C C H H H H H H H H H H H H H
charge: -0.070784 -0.443012 -0.239531 -0.371035 -0.357540 0.535268 -0.689014 -0.358142 -0.363167 -0.228820 -0.236404 -0.227296 0.222896 0.209698 0.221844 0.215526 0.201036 0.210486 0.210115 0.217846 0.275329 0.339829 0.256679 0.232507 0.235687
chargesum: 0.00000
title: Mulliken charges with hydrogens summed into heavy atoms:
elementType: Cl O C C C C C C C C C C
charge: -0.070784 -0.103184 -0.016635 0.060507 0.059022 0.535268 -0.050567 -0.358142 -0.087839 0.027859 -0.003897 0.008391
polarizability: 1.29946416e+02 3.67779358e+00 1.27187719e+02 1.87536539e+01 5.71395156e+00 9.07412560e+01
1716.lowfreq: -5.8581 -0.0019 -0.0018 0.0007 2.8063 5.8961 39.6591 60.0305 75.3502
frequency: 39.4899 59.9910 75.3298 124.0227 152.2553 173.9275 197.5532 233.7417 247.7117 295.8767 351.1831 378.5641 388.2124 407.2501 464.7961 490.0890 561.8362 600.4246 667.3369 731.7396 742.8972 764.5116 777.2751 869.5553 890.4477 894.8025 954.2101 960.0148 988.9009 1000.9104 1013.2637 1036.6146 1066.0029 1083.7467 1113.4887 1121.5254 1169.5937 1193.0810 1212.7444 1240.6148 1263.1928 1288.5860 1289.7694 1324.5986 1347.6764 1360.8991 1381.3417 1389.5737 1424.4901 1455.3390 1464.7519 1474.4187 1477.5114 1487.0052 1573.0147 1603.2815 2973.4944 2977.5592 2983.4862 2992.6119 3021.7042 3051.4320 3072.9079 3074.8081 3134.5844 3147.2675 3161.2457 3175.3136 3549.5144
redmass: 5.2670 3.8375 1.6056 3.5018 3.9786 5.1221 3.9419 1.2047 3.6132 3.6322 1.2048 3.4737 10.1709 3.7003 3.5526 4.3393 3.2502 4.6803 5.3144 2.4552 1.6704 1.2674 2.2884 1.3430 1.4787 1.6735 1.3982 5.0448 1.3444 2.7205 6.2588 2.1127 2.2798 1.4816 2.0424 1.6870 1.0661 1.8854 1.4295 1.3111 1.4830 1.2170 1.1973 1.4554 1.4719 1.5571 4.5212 1.2141 2.1522 2.0035 1.1978 1.0602 1.0425 1.0815 6.1955 7.0396 1.0367 1.0595 1.0674 1.0760 1.0998 1.1028 1.1014 1.0992 1.0856 1.0903 1.0955 1.0995 1.0660
irintensity: 0.7722 0.0513 0.0212 0.4393 2.6061 1.2636 0.0697 0.0434 0.2109 3.1143 136.0040 28.4838 11.9565 1.1790 7.4723 9.3666 5.9122 5.9934 17.9204 3.5716 6.3799 80.7429 10.0238 0.8775 11.5622 23.9693 5.2997 42.2892 0.5275 12.9823 46.9474 9.2943 1.5636 10.1585 10.0002 4.6866 0.6624 1.0701 11.7039 11.3796 7.1022 13.2924 11.8534 4.8660 17.9686 4.0284 4.5456 10.5779 25.1519 27.4867 1.8792 4.2815 11.9956 12.8138 12.8012 2.6214 38.9923 1.7170 27.2297 34.9994 0.1941 15.8951 92.6076 43.9353 1.5710 6.3572 13.0953 13.1007 5.9245
temp: 298.150 k
press: 1.00000 atm
elementType: 17 8 6 6 6 6 6 6 6 6 6 6 1 1 1 1 1 1 1 1 1 1 1 1 1
symmnumber: 1
zpe: 536267.4 jmol-1
zpe.correction: 0.204253 hartree
zpe.thermalcorrener: 0.216789 hartree
zpe.thermalcorrenthalpy: 0.217733 hartree
zpe.thermalcorrgfe: 0.164662 hartree
zpe.sumelectzpe: -923.232218 hartree
zpe.sumelectthermal: -923.219683 hartree
zpe.sumelectthermalent: -923.218739 hartree
zpe.sumelectthermalfe: -923.271810 hartree
dipole: -1.5976 -0.5939 -0.7843
dipole: 1.8762
quadrupole: -74.3850 -80.4420 -78.4075
quadrupole: 4.1118 0.9593 1.9120
quadrupole: 3.3599 -2.6972 -0.6627 4.1118 0.9593 1.9120
hfenergy: -923.4364716 hartree
pointgroup: C01 [X(C10H13Cl1O1)]
dipole: -0.6294087 0.3855749 0.0069265 debye
dipolederiv: -0.1920442 0.1427493 -0.0701398 0.1539999 -0.5388113 0.2991956 -0.0688146 0.2849911 -0.291621 -0.4376831 0.2069697 0.0445263 0.2504105 -0.4187012 -0.1586884 0.0575341 -0.1739306 -0.8245603 0.4070636 -0.0529963 -0.005169 -0.1534325 0.3520184 0.18301 -0.0378904 0.137393 0.6387364 0.0110156 -0.0729356 -0.0609991 0.0056102 0.0764705 -0.0707651 0.0551589 -0.054111 -0.0205265 0.0613337 -0.0473236 -0.0150036 -0.0614215 0.1138248 -0.0145507 0.0254777 -0.0053711 0.0772056 0.0284018 0.0509894 -0.009752 -0.0095909 -0.2473096 0.112383 -0.0553815 0.0935565 -0.220502 0.0144496 -0.0588697 -0.036678 -0.0492704 0.0629047 -0.0175128 -0.0677188 -0.0323576 0.0461051 0.1523713 -0.2752048 0.1020455 -0.2091405 0.6823734 -0.525153 0.0764832 -0.4862004 0.318502 -0.0824051 -0.0473595 -0.0278922 -0.0054292 -0.0318542 -0.0922441 -0.1002104 -0.0467516 -0.0338045 -0.1046246 0.0942494 -0.0687055 0.0878124 -0.2200296 0.0422931 -0.0884723 0.0478751 -0.0724337 -0.070441 -0.0768743 0.0013378 -0.0723173 0.0200988 -0.1064905 0.0107065 -0.1011193 -0.0583571 0.0224831 -0.0582035 -0.0927465 -0.0960455 -0.022039 -0.0392765 -0.0520183 -0.0805065 -0.048857 0.0151083 0.0031175 0.0060313 0.0322307 -0.0936328 0.0362383 -0.030805 0.0639206 -0.0325643 0.0700943 0.0341758 -0.0397153 0.0087733 -0.1103045 0.0747759 -0.0179454 0.0662393 0.0222131 -0.1420019 0.0764186 0.0968991 0.0463412 0.0506603 -0.0401927 0.0550771 -0.0279858 0.0306669 -0.1038826 0.0557632 0.0893607 0.0807935 0.0294125 -0.0396591 0.092939 -0.0325792 -0.0016934 0.0714584 -0.0136792 -0.0135793 -0.0020063 -0.1494284 0.0835913 -0.0216069 0.0513431 0.019378 0.0627357 0.0412217 -0.0266468 -0.0151385 -0.1472577 0.061364 0.0071169 0.1068858 0.0607785 -0.1168196 0.0511067 0.0646635 0.0907712 0.0354081 -0.0539194 0.1266479 -0.0457213 0.044368 0.0467395 -0.0246261 -0.0469612 -0.0288058 0.0831692 -0.0156696 -0.1050893 -0.0377513 -0.1877998 0.0796313 -0.0201021 0.0717687 -0.0213306 0.0858541 0.060675 0.069702 0.0655002 0.0457557 0.1118628 -0.1782563 -0.0932437 -0.2051799 0.2442036 0.0323316 -0.077771 0.0219496 0.2820007 0.0692784 -0.003787 0.0721725 -0.0167737 0.0960327 0.0747098 0.0882723 0.0677278 0.0391239 0.0747432 0.075959 -0.0086637 0.0917875 -0.0219236 0.1013068 -0.0110497 0.1071915 0.0673751 -0.0488684 0.0974976 0.0670903 0.0973521 0.0688608 0.0122474 0.0696577 0.0098122 0.1005106 unknown
polarizability: 130.1668683|-16.6912|110.6693058|-8.6956823|-19.1779486|107.039217 unknown
InChI: InChI=1S/C10H13ClO/c1-2-5-10(12)8-6-3-4-7-9(8)11/h3-4,6-7,10,12H,2,5H2,1H3
charge 0 multiplicity 1
25 atoms
Cl -0.581539 -2.127066 1.576345
O  1.02969 -0.798081 -2.35587
C  0.975812 -0.739947 -0.876288
C  2.20308 0.100403 -0.46791
C  2.438492 0.174614 1.056545
C  -0.34957 -0.132067 -0.416351
C  3.684906 1.015957 1.406981
C  -1.132388 -0.63936 0.645121
C  -0.849464 1.017799 -1.08776
C  -2.351418 -0.055432 1.04483
C  -2.063323 1.625753 -0.708713
C  -2.817892 1.088689 0.361057
H  1.076072 -1.760449 -0.454252
H  2.085024 1.120647 -0.883728
H  3.085734 -0.348938 -0.962684
H  1.548536 0.607165 1.554088
H  2.555561 -0.849292 1.464092
H  3.579059 2.05415 1.039678
H  4.595753 0.588914 0.946563
H  3.846185 1.058667 2.499557
H  -0.26256 1.410302 -1.925345
H  0.260748 -1.3333 -2.680963
H  -2.92138 -0.488037 1.872042
H  -2.423152 2.510765 -1.244193
H  -3.763765 1.550143 0.663957
