program: Gaussian 09
title: 000225838
version: EM64L-G09RevD.01
frameworkgroup: C1[X(C11H14O3)]
method: RPBEPBE
basis: SDD
operation: Freq
keyword: #pfreq=noraman
keyword: PBEPBE/SDD
title: #p freq=noraman PBEPBE/SDD
converged: YES YES NO NO
title: Mulliken charges:
elementType: O O O C C C C C C C C C C C H H H H H H H H H H H H H H
charge: -0.270390 -0.266653 -0.439577 -0.075353 -0.583467 0.556421 -0.346553 -0.707388 -0.548288 -0.400218 0.199105 0.161080 -0.336949 -0.201806 0.207732 0.214277 0.208243 0.218078 0.204925 0.244777 0.209036 0.206490 0.260034 0.235531 0.248710 0.236250 0.236398 0.329554
chargesum: 0.00000
title: Mulliken charges with hydrogens summed into heavy atoms:
elementType: O O O C C C C C C C C C C C
charge: -0.270390 -0.266653 -0.110022 0.132379 -0.160948 0.556421 0.076450 -0.047085 -0.288254 -0.164687 0.199105 0.161080 -0.088239 0.270842
polarizability: 1.74644652e+02 -1.57365468e+01 1.08936208e+02 1.03373086e+01 1.41557175e+01 9.81424731e+01
1716.lowfreq: -60.1460 -6.6898 -0.5465 -0.0006 -0.0003 0.0004 2.8277 27.5652 47.8867
frequency: -60.1316 27.1411 47.8613 68.8042 116.8988 168.0881 217.6066 223.5252 243.4877 259.7716 298.1754 304.4023 327.1324 404.2255 419.7686 422.0029 488.6636 519.9713 589.3419 631.9940 678.6611 717.5897 749.4071 776.0089 805.1891 826.4842 841.0988 873.8659 879.0370 897.3715 925.0194 930.6361 945.9605 975.3842 981.6391 1056.8067 1063.3716 1064.3342 1095.4043 1119.2999 1125.7228 1133.7738 1151.1078 1180.9654 1235.9378 1253.8187 1268.7660 1281.7011 1302.1359 1338.9519 1349.2358 1364.8273 1369.0443 1389.4247 1396.0481 1437.6914 1462.9684 1470.1684 1475.1220 1476.8568 1485.2118 1487.6285 1609.6224 1628.1914 2948.4561 2972.6387 2974.1761 2977.0451 3010.1634 3030.5825 3059.5590 3066.7252 3086.9336 3087.1331 3131.4416 3161.7929 3178.3435 3559.1793
redmass: 2.3206 4.8013 5.2454 2.8663 3.5047 4.5089 2.2381 1.5589 3.5745 3.3014 2.4557 1.1970 6.2262 2.3282 3.2449 2.7071 3.7285 4.9278 4.9890 4.9508 9.5630 4.5680 4.4128 5.9446 1.7170 1.8277 10.0156 1.9886 1.5082 1.6302 1.9204 1.3816 1.8843 4.8173 4.2370 3.0376 1.6801 1.4597 1.6312 1.0363 1.5622 1.9187 1.3401 1.7067 1.4942 4.0888 1.3646 1.3277 1.2682 1.3642 1.4506 1.2755 1.2377 1.2291 3.8258 4.4971 1.0732 1.0977 1.1118 1.9672 1.0601 1.3380 7.7920 8.3952 1.0825 1.0460 1.0584 1.0549 1.0533 1.1023 1.1007 1.0991 1.0993 1.1189 1.0897 1.0929 1.0954 1.0661
irintensity: 14.3719 0.0905 0.4741 1.6139 3.5334 1.4870 0.3453 0.7837 2.3646 1.1201 6.1183 112.7436 7.2187 10.3744 5.2505 10.0554 6.1992 5.7497 3.3363 8.5732 0.4728 1.2255 10.0523 10.7647 39.9141 10.4317 29.4862 1.9658 22.4828 24.0119 1.8295 1.1431 2.4241 165.6167 84.9104 13.4155 4.9113 4.2133 19.9668 0.0009 7.2509 3.9138 2.3118 50.2936 9.0700 179.9633 2.2917 3.7874 9.5506 13.0609 6.2864 0.6966 9.5297 15.7946 12.6701 39.2942 0.7285 5.2076 18.4379 130.0538 11.1638 33.4645 7.3027 0.7577 16.3016 59.9327 27.0839 44.8914 125.9792 17.2128 16.9369 66.4917 16.7630 39.1305 12.3036 4.0849 4.5096 7.1453
temp: 298.150 k
press: 1.00000 atm
elementType: 8 8 8 6 6 6 6 6 6 6 6 6 6 6 1 1 1 1 1 1 1 1 1 1 1 1 1 1
symmnumber: 1
zpe: 597537.8 jmol-1
zpe.correction: 0.227590 hartree
zpe.thermalcorrener: 0.240540 hartree
zpe.thermalcorrenthalpy: 0.241485 hartree
zpe.thermalcorrgfe: 0.187094 hartree
zpe.sumelectzpe: -652.143928 hartree
zpe.sumelectthermal: -652.130978 hartree
zpe.sumelectthermalent: -652.130033 hartree
zpe.sumelectthermalfe: -652.184424 hartree
dipole: 1.3209 1.3550 0.1013
dipole: 1.8951
quadrupole: -85.2222 -86.2153 -80.9672
quadrupole: -11.2230 1.5458 2.7859
quadrupole: -1.0873 -2.0804 3.1677 -11.2230 1.5458 2.7859
hfenergy: -652.3715179 hartree
pointgroup: C01 [X(C11H14O3)]
dipole: 0.5488887 -0.5035486 -0.0322303 debye
polarizability: 173.1749628|19.0192359|110.6109268|-9.2845917|14.0997467|97.937444 unknown
InChI: InChI=1S/C11H14O3/c1-8(6-12)4-9-2-3-10-11(5-9)14-7-13-10/h2-3,5,8,12H,4,6-7H2,1H3
charge 0 multiplicity 1
28 atoms
O  2.714207 1.495957 0.854183
O  3.594573 -0.06099 -0.754258
O  -3.779467 1.48469 -1.470574
C  -2.905348 -0.40894 -0.068432
C  -1.824752 -0.785498 0.993873
C  -0.386601 -0.629571 0.512738
C  -2.870796 1.105239 -0.372974
C  -4.31196 -0.845518 0.395243
C  0.429967 0.43445 1.000926
C  0.148035 -1.542129 -0.434815
C  1.734426 0.529405 0.511094
C  2.250269 -0.382409 -0.431921
C  1.47791 -1.435898 -0.926402
C  3.922447 1.138927 0.062125
H  -2.655027 -0.949759 -1.007577
H  -2.004433 -1.836687 1.294115
H  -1.992175 -0.168606 1.899153
H  -1.834375 1.433237 -0.594201
H  -3.244284 1.676502 0.495927
H  -5.080672 -0.484119 -0.310122
H  -4.388839 -1.94631 0.468652
H  -4.542334 -0.422144 1.39212
H  0.050266 1.149854 1.736315
H  -0.48078 -2.365051 -0.794448
H  1.882326 -2.146735 -1.651486
H  4.744509 0.888541 0.75503
H  4.169282 1.976676 -0.612808
H  -3.452373 1.067485 -2.307477
