program: Gaussian 09
title: 000225835
version: EM64L-G09RevD.01
frameworkgroup: C1[X(C10H12ClNO)]
method: RPBEPBE
basis: SDD
operation: Freq
keyword: #p
keyword: freq=noraman
keyword: PBEPBE/SDD
title: #p freq=noraman PBEPBE/SDD
converged: YES YES NO NO
title: Mulliken charges:
elementType: Cl O N C C C C C C C C C C H H H H H H H H H H H H
charge: -0.062302 -0.255167 -0.460514 -0.219964 0.217840 -0.678467 -0.678583 0.496802 -0.440554 -0.328184 -0.184209 -0.201372 -0.118568 0.198483 0.217333 0.216564 0.246601 0.216586 0.217239 0.246846 0.302990 0.225825 0.314546 0.254978 0.255249
chargesum: 0.00000
title: Mulliken charges with hydrogens summed into heavy atoms:
elementType: Cl O N C C C C C C C C C C
charge: -0.062302 -0.255167 -0.157524 -0.021480 0.217840 0.002031 0.002087 0.496802 -0.214728 -0.013637 0.070769 0.053877 -0.118568
polarizability: 2.11539832e+02 8.71038598e-01 1.16965950e+02 2.06150531e-02 8.03696538e-02 7.01277587e+01
1716.lowfreq: -7.8092 -5.4516 -0.0021 -0.0016 -0.0010 10.3102 27.2318 48.7366 64.7310
frequency: 25.6699 48.6523 64.7265 101.8579 145.1053 211.3337 215.3244 229.8528 246.1323 257.3467 303.9101 349.1789 350.1410 376.0266 412.1790 452.4263 511.2380 617.3889 640.5918 646.9034 670.5706 703.9302 721.7178 808.2581 814.5179 847.9711 869.5064 921.5672 927.7409 936.9231 963.6065 983.7349 993.3071 1072.4833 1093.4104 1106.3621 1114.2107 1143.3033 1182.7487 1186.8318 1259.6671 1286.0423 1291.6740 1337.5476 1367.9298 1375.4994 1395.0516 1398.7251 1463.2851 1472.3853 1477.2113 1477.6401 1492.0334 1495.6045 1592.7437 1605.5487 1623.6107 2964.8358 2983.9699 2986.1738 3078.7096 3082.9868 3093.3187 3098.6216 3120.2656 3165.4499 3171.8593 3195.6641 3528.6459
redmass: 3.5507 3.8090 6.7550 5.1553 5.3334 1.0631 3.0105 3.2780 3.5559 1.5513 3.7243 5.0208 4.3793 4.3042 3.0261 4.2452 2.6970 5.7186 5.0943 1.1670 3.7216 3.6372 6.2346 5.2179 1.4019 1.4132 4.0688 1.1491 2.8788 1.3599 1.4738 1.3150 4.2370 2.6742 1.5060 2.4966 1.3499 2.6186 1.1974 1.7548 2.1504 1.3760 1.3518 1.8095 3.3253 1.1881 1.2258 4.5493 1.0438 1.0499 1.1886 1.8690 1.1034 2.1020 6.6998 6.1200 4.6881 1.0829 1.0347 1.0366 1.1009 1.0999 1.1008 1.1001 1.0901 1.0913 1.0952 1.0955 1.0762
irintensity: 0.9558 0.2544 3.5860 1.0120 1.9536 0.2484 0.9324 1.5395 2.4637 1.8673 10.2875 1.2334 3.2549 12.1092 0.0681 8.1158 34.9616 1.8565 5.5148 51.7399 9.9337 2.1972 2.1633 8.4939 40.8312 60.2737 2.4891 6.4376 25.6140 1.3937 0.3306 3.2792 26.6966 47.1745 21.3251 0.3519 17.9861 63.8272 14.1774 9.6470 27.3217 0.1487 26.2314 29.1503 89.5929 15.0716 36.3162 16.1676 5.0406 3.5514 25.2741 84.6232 15.3974 491.7424 30.3326 12.1331 89.5188 38.5157 35.4475 26.7777 20.5926 56.3771 3.1127 36.9124 14.9999 2.6051 2.7791 8.8080 11.9307
temp: 298.150 k
press: 1.00000 atm
elementType: 17 8 7 6 6 6 6 6 6 6 6 6 6 1 1 1 1 1 1 1 1 1 1 1 1
symmnumber: 1
zpe: 521281.1 jmol-1
zpe.correction: 0.198545 hartree
zpe.thermalcorrener: 0.211686 hartree
zpe.thermalcorrenthalpy: 0.212630 hartree
zpe.thermalcorrgfe: 0.157530 hartree
zpe.sumelectzpe: -977.355411 hartree
zpe.sumelectthermal: -977.342270 hartree
zpe.sumelectthermalent: -977.341326 hartree
zpe.sumelectthermalfe: -977.396426 hartree
dipole: -2.7410 3.8447 0.0355
dipole: 4.7219
quadrupole: -87.0229 -79.0016 -87.2083
quadrupole: -6.1809 -0.0721 -0.0237
quadrupole: -2.6120 5.4094 -2.7974 -6.1809 -0.0721 -0.0237
hfenergy: -977.553956 hartree
pointgroup: C01 [X(C10H12Cl1N1O1)]
dipole: -1.0401084 -1.4423153 0.5376953 debye
dipolederiv: -0.9487334 -0.1080483 0.0078185 -0.1371534 -0.138326 0.0218728 0.0197842 0.0230202 -0.0801285 -0.7493645 -0.0840107 0.0167601 0.4567032 -0.7816463 0.1916374 -0.2019136 0.1698609 -0.4286605 -1.8777096 0.2091634 -0.1510069 0.3202339 -0.3488938 0.0368742 -0.1966275 0.0325437 -0.3135364 -0.1956191 -0.0698204 0.0168293 -0.0402418 0.1114639 -0.0227853 0.0038124 -0.0242308 0.069734 1.7637845 -0.1340675 0.1242174 -0.8619419 0.9048045 -0.3489432 0.4217597 -0.3195407 0.2736023 -0.0031462 0.0338613 0.0221427 -0.084699 0.0014347 -0.016634 -0.0322887 -0.0428159 0.0192037 -0.0060338 0.0054142 -0.0381497 -0.0397237 0.0383795 -0.007012 0.0832255 0.0264854 -0.0162375 1.2426454 0.0528163 0.0257362 0.3364987 0.0071224 0.0553674 -0.0888953 0.043607 0.0884619 -0.2189394 -0.0160469 0.0058858 0.0925406 0.0234423 -0.0891304 -0.0385518 -0.0937655 -0.1648316 -0.2140644 0.0066237 -0.0051796 -0.13869 -0.0553597 -0.0468397 0.0533973 -0.0404032 -0.1354432 -0.2150191 -0.0310746 0.0079107 -0.1280884 0.0112729 -0.0498768 0.0486212 -0.0461095 -0.0757068 -0.2293119 -0.0238864 0.004252 0.0321549 0.0485444 -0.0593372 -0.0193703 -0.0614749 -0.0735087 1.2152418 0.1862892 -0.0222307 0.2185497 0.0446154 -0.0449177 -0.0356649 -0.0460334 -0.0690788 -0.0117882 0.0762231 -0.032341 0.0478052 -0.1611621 0.0770275 -0.0208633 0.0782509 -0.0083861 0.0637962 0.0060291 -0.1135814 0.0106667 0.0820681 -0.0171332 -0.0746177 -0.0361638 -0.1388021 -0.185873 -0.075425 0.0562358 -0.0846894 0.0482747 -0.000478 0.0451873 -0.0102773 0.0852146 0.12055 0.0073137 0.0123017 0.0564404 -0.0686167 0.0353534 -0.0259557 0.0895152 0.0616071 -0.1821675 -0.1017005 -0.0069872 -0.0997851 0.0664675 0.0064302 0.0066382 0.0162232 0.063711 0.0491812 0.0924531 0.0889164 0.0698152 0.0057754 -0.1118799 0.0571677 -0.0918837 -0.048181 0.1220805 -0.0011001 -0.0114571 0.056605 -0.0660043 0.094198 -0.0163561 0.0353835 0.0584816 0.1827681 -0.0019191 -0.0033781 -0.0293344 0.1224528 0.0644611 0.0064379 0.0654326 0.2583801 0.0196586 -0.099166 0.0346574 -0.0820713 -0.0359799 0.0802644 0.0273807 0.079581 0.1349502 0.1648777 0.049009 -0.0209507 0.0169775 0.0945352 0.035415 -0.0079782 0.0364304 0.1627047 0.0260922 0.0681141 -0.0340002 0.0665065 0.0398601 0.054564 -0.0334883 0.0545716 0.1412975 0.0670938 -0.0470448 0.0155986 -0.0550792 0.005475 0.061502 0.0191594 0.061793 0.1351526 unknown
polarizability: 211.3152086|3.3969254|110.2611262|4.5056263|-16.3774528|77.0572059 unknown
InChI: InChI=1S/C10H12ClNO/c1-7(2)10(13)12-9-5-3-8(11)4-6-9/h3-7,12H,1-2H3
charge 0 multiplicity 1
25 atoms
Cl 5.082604 0.447236 -0.00967
O  -1.857768 1.314453 -0.644686
N  -0.8767 -0.648862 0.19088
C  -3.344303 -0.519111 0.030951
C  -1.969278 0.142724 -0.175961
C  -4.17296 0.326698 1.031632
C  -4.067571 -0.628939 -1.336071
C  0.51174 -0.340173 0.123002
C  1.427509 -1.331161 0.570499
C  1.005541 0.899358 -0.36741
C  2.816677 -1.098285 0.533011
C  2.397075 1.132132 -0.405092
C  3.284739 0.136435 0.043162
H  -3.212833 -1.539285 0.448791
H  -3.687953 0.379767 2.023308
H  -5.179445 -0.110695 1.160491
H  -4.282316 1.355757 0.647389
H  -5.076561 -1.058876 -1.202235
H  -3.509243 -1.267493 -2.044608
H  -4.168192 0.374622 -1.784667
H  -1.103236 -1.576826 0.556281
H  1.058113 -2.29163 0.95166
H  0.300748 1.658537 -0.710329
H  3.518339 -1.862685 0.87827
H  2.780974 2.0843 -0.782499
