program: Gaussian 09
title: 000225834
version: EM64L-G09RevD.01
frameworkgroup: C1[X(C10H12ClNO)]
method: RPBEPBE
basis: SDD
operation: Freq
keyword: #p
keyword: freq=noraman
keyword: PBEPBE/SDD
title: #p freq=noraman PBEPBE/SDD
converged: YES YES NO NO
title: Mulliken charges:
elementType: Cl O N C C C C C C C C C C H H H H H H H H H H H H
charge: -0.068071 -0.252199 -0.465281 -0.220198 0.219490 -0.678819 -0.678258 0.513041 -0.442321 -0.357787 -0.042563 -0.192539 -0.256646 0.199525 0.217767 0.216681 0.246758 0.217132 0.217650 0.246284 0.306370 0.248966 0.313592 0.233588 0.257838
chargesum: 0.00000
title: Mulliken charges with hydrogens summed into heavy atoms:
elementType: Cl O N C C C C C C C C C C
charge: -0.068071 -0.252199 -0.158912 -0.020673 0.219490 0.002387 0.002808 0.513041 -0.193354 -0.044195 -0.042563 0.041049 0.001192
polarizability: 1.97555169e+02 3.06454647e+00 1.26841007e+02 -8.42248022e-02 2.13894840e-01 7.02558245e+01
1716.lowfreq: -14.4922 -9.7104 -5.8107 0.0016 0.0017 0.0022 9.6446 44.5557 74.3005
frequency: 4.6214 44.4837 74.3000 101.5974 183.1902 192.1831 200.7355 212.9624 230.0600 253.9204 295.1993 301.2560 359.0653 400.5856 409.7450 439.7149 564.3909 590.7442 647.6852 654.1172 685.2696 686.3275 720.9740 791.8947 843.9805 863.7014 867.3937 914.9630 921.8820 936.0057 962.7664 978.4517 994.5032 1071.0811 1092.1941 1098.4867 1105.7433 1143.5106 1176.2293 1184.8437 1249.9767 1287.6062 1299.8256 1341.6568 1371.6336 1374.8869 1394.0593 1407.0952 1460.6022 1471.7522 1471.9664 1476.6721 1490.0227 1501.4637 1583.4177 1611.3324 1626.3402 2965.8782 2984.5138 2986.5485 3079.7601 3083.7480 3092.6096 3098.2636 3142.7403 3147.3002 3179.9366 3199.7644 3527.3755
redmass: 3.0981 5.0782 5.0770 4.9409 5.1792 1.1956 3.4408 2.4522 1.5720 2.5503 4.0139 3.8400 5.9238 3.1117 6.1825 3.0808 3.9697 5.3551 3.9376 1.2356 4.6537 2.3221 6.3043 1.3253 5.1900 1.5921 4.0643 1.3668 1.1528 3.0367 1.4723 5.9227 1.3127 2.0559 1.5376 1.5452 2.5294 2.6076 1.1103 1.9104 1.7749 1.3677 1.5847 1.6546 3.5427 1.1887 1.2313 3.5907 1.0438 1.0598 2.5438 1.0664 1.0607 2.1627 5.9413 6.2219 4.9642 1.0829 1.0346 1.0366 1.1008 1.1000 1.1009 1.1001 1.0923 1.0890 1.0955 1.0956 1.0763
irintensity: 0.1060 5.3877 1.5583 2.0144 1.7590 1.0022 0.9403 3.5477 2.5111 0.6400 0.0698 12.0519 3.8227 5.4386 2.4481 6.0003 2.7280 7.4398 8.4666 58.6149 11.8873 26.2856 2.4961 54.4009 33.8898 44.1904 6.0695 4.0657 7.5803 8.5491 0.2989 11.0807 4.3534 27.0233 24.7094 11.7169 0.3887 119.4436 3.5740 22.5836 15.5995 0.1443 42.1162 17.1656 99.0537 15.0428 38.3170 52.9922 4.9564 6.3765 171.4936 13.0607 17.2315 237.0829 168.3816 98.3848 78.4375 38.2201 35.0874 25.3460 20.8086 54.8547 2.7214 36.8591 5.8730 8.5561 2.7039 8.3767 12.0037
temp: 298.150 k
press: 1.00000 atm
elementType: 17 8 7 6 6 6 6 6 6 6 6 6 6 1 1 1 1 1 1 1 1 1 1 1 1
symmnumber: 1
zpe: 521030.6 jmol-1
zpe.correction: 0.198450 hartree
zpe.thermalcorrener: 0.211687 hartree
zpe.thermalcorrenthalpy: 0.212632 hartree
zpe.thermalcorrgfe: 0.155738 hartree
zpe.sumelectzpe: -977.355676 hartree
zpe.sumelectthermal: -977.342438 hartree
zpe.sumelectthermalent: -977.341494 hartree
zpe.sumelectthermalfe: -977.398388 hartree
dipole: 1.5203 -2.2491 -0.0117
dipole: 2.7148
quadrupole: -86.4593 -80.0350 -87.2106
quadrupole: -13.5751 -0.0574 0.0519
quadrupole: -1.8910 4.5333 -2.6423 -13.5751 -0.0574 0.0519
hfenergy: -977.5541257 hartree
pointgroup: C01 [X(C10H12Cl1N1O1)]
dipole: -0.6563348 -0.8128686 0.2219389 debye
dipolederiv: -0.5775405 0.2885677 -0.1281563 0.3756674 -0.3861642 0.1260926 -0.1564851 0.1201442 -0.128701 -0.7982536 -0.0586531 -0.0112529 0.4493577 -0.7634636 0.1647701 -0.1795798 0.1319721 -0.4061026 -1.9709321 0.0552026 -0.1329436 0.0975412 -0.3263259 0.0168106 -0.1469603 0.0142533 -0.310561 -0.1778206 -0.1118973 0.0192181 -0.0848584 0.0842086 -0.0168289 0.0049589 -0.0199331 0.0669078 1.9201683 -0.0487886 0.1427018 -0.7358176 0.8447131 -0.283889 0.3706486 -0.2388068 0.2314763 0.0067038 0.034733 0.0259765 -0.0815309 0.0006958 -0.0127601 -0.0282337 -0.0463186 0.0161118 0.0026007 0.0049899 -0.0369513 -0.0485175 0.0341802 -0.0106426 0.0771552 0.0362229 -0.0139834 1.2416012 0.1655664 0.0204147 0.476519 0.1903669 0.0123891 -0.0830326 -0.0091502 0.1257461 -0.5638549 0.0324137 -0.0366799 0.1958099 -0.1211003 -0.006045 -0.0897177 -0.0167749 -0.1802226 -0.3148052 -0.0285678 -0.0006976 -0.273807 -0.1561096 -0.0236328 0.0803794 -0.0071003 -0.1644417 0.896947 -0.3804914 0.1875385 -0.5772444 0.6025899 -0.2493413 0.2516306 -0.2359917 0.055601 0.2295435 -0.0508084 0.0405574 0.0766442 0.1435314 -0.0843917 -0.0010907 -0.0930772 -0.0992283 -0.3031688 0.1449187 -0.0583165 0.169492 -0.2829314 0.0556089 -0.0659289 0.0539387 -0.1699159 -0.0344145 0.0997747 -0.0383804 0.0725022 -0.1430281 0.062912 -0.0285503 0.0645287 0.0000347 0.0573047 0.0059501 -0.1129841 0.0110511 0.0873884 -0.0229375 -0.0707642 -0.0349375 -0.1380826 -0.1527679 -0.1050791 0.054179 -0.1170834 0.0206475 0.0066808 0.0440967 -0.0058437 0.0838927 0.1072333 0.0329078 0.0077119 0.0847086 -0.0612352 0.0288778 -0.0354735 0.0782217 0.067847 -0.1431238 -0.1301766 -0.0096455 -0.131703 0.0300528 0.0070207 0.0028813 0.0201398 0.0646505 0.0272832 0.086337 0.1078353 0.0671078 0.03932 -0.0937057 0.0717657 -0.0798984 -0.0598155 0.1058543 0.0265071 -0.0262785 0.0861011 -0.0604614 0.0841886 -0.0200391 0.0262113 0.0645621 0.189929 0.005825 -0.0080128 -0.0144693 0.1124435 0.0558092 -0.000924 0.0571545 0.2658414 0.0761904 -0.0602102 0.0131763 -0.0594546 -0.0207342 0.0604998 0.0129119 0.0603989 0.1571953 0.1541234 0.0610724 -0.021556 0.0415767 0.1036762 0.0286202 -0.015159 0.0300346 0.1717175 0.057872 -0.0236041 0.0014305 -0.0446488 -0.07262 0.071007 0.0083101 0.0723964 0.1298488 -0.0366732 -0.0464896 0.0011155 -0.0349442 0.1003596 0.0228869 -0.0027993 0.0222154 0.1696216 unknown
polarizability: 196.2800152|-4.9740079|121.8234343|10.135406|-17.1762445|76.548551 unknown
InChI: InChI=1S/C10H12ClNO/c1-7(2)10(13)12-9-5-3-4-8(11)6-9/h3-7,12H,1-2H3
charge 0 multiplicity 1
25 atoms
Cl 4.333109 -1.581878 0.813086
O  -2.009416 1.296709 -0.559007
N  -0.719498 -0.540149 0.136239
C  -3.182562 -0.774696 0.040877
C  -1.929541 0.098436 -0.157915
C  -4.106441 -0.110244 1.093318
C  -3.912599 -0.93435 -1.31773
C  0.604435 -0.024193 0.054331
C  1.66381 -0.903601 0.412774
C  0.8965 1.303333 -0.36172
C  2.986244 -0.438359 0.347891
C  2.24105 1.727759 -0.412419
C  3.308522 0.869479 -0.060299
H  -2.887203 -1.780022 0.407678
H  -3.615565 -0.035888 2.080661
H  -5.03563 -0.696369 1.210693
H  -4.371762 0.909412 0.764012
H  -4.838262 -1.523286 -1.187061
H  -3.279166 -1.444787 -2.065834
H  -4.180452 0.059897 -1.715548
H  -0.79549 -1.51014 0.451553
H  1.458107 -1.930387 0.735393
H  0.077328 1.970169 -0.633976
H  2.465116 2.750707 -0.73311
H  4.348169 1.204143 -0.101487
