program: Gaussian 09
title: 000225837
version: EM64L-G09RevD.01
frameworkgroup: C1[X(C10H12N2O3)]
method: RPBEPBE
basis: SDD
operation: Freq
keyword: #p
keyword: freq=noraman
keyword: PBEPBE/SDD
title: #p freq=noraman PBEPBE/SDD
converged: YES YES NO NO
title: Mulliken charges:
elementType: O O O N N C C C C C C C C C C H H H H H H H H H H H H
charge: -0.240521 -0.218301 -0.212937 -0.458208 0.020716 -0.223383 0.224613 -0.675898 -0.675145 0.505852 -0.427739 -0.311864 0.392214 -0.344595 -0.364693 0.201857 0.218502 0.219982 0.247768 0.220759 0.218116 0.247398 0.309655 0.232221 0.318478 0.287781 0.287373
chargesum: 0.00000
title: Mulliken charges with hydrogens summed into heavy atoms:
elementType: O O O N N C C C C C C C C C C
charge: -0.240521 -0.218301 -0.212937 -0.148553 0.020716 -0.021526 0.224613 0.010354 0.011128 0.505852 -0.195518 0.006613 0.392214 -0.056813 -0.077320
polarizability: 2.47525563e+02 4.07370212e-01 1.32227422e+02 2.63755919e-01 -2.85169588e-01 7.23066839e+01
1716.lowfreq: -8.1152 -6.7063 -0.0006 -0.0004 0.0006 7.0494 21.3995 43.7267 56.8467
frequency: 20.4552 43.6655 56.8449 78.6984 97.2292 139.7573 204.9199 209.7842 217.3813 241.5845 249.7096 301.2982 327.9228 337.6947 373.0076 416.3189 451.7280 508.0920 508.2163 617.1561 634.3471 665.8942 668.1106 668.1679 722.0259 741.2880 767.1064 821.5449 836.7594 869.2626 881.5109 922.5565 926.8434 964.2305 978.8972 998.8560 1012.4890 1094.6958 1095.8256 1104.6524 1117.8159 1133.5952 1176.5341 1185.2785 1224.9158 1266.9070 1284.8040 1294.8944 1341.0258 1356.5758 1376.9469 1387.0897 1396.8575 1426.4486 1463.7741 1471.8831 1478.1428 1484.6430 1492.0074 1501.6474 1595.8847 1612.2622 1632.0761 2967.1245 2986.0399 2988.0694 3081.3692 3085.5872 3095.3642 3100.5967 3126.2577 3178.5113 3185.6608 3202.1601 3522.5202
redmass: 3.4183 4.2417 10.0263 5.7130 5.1353 5.4161 3.3381 1.0898 5.2912 3.4063 1.2808 3.3259 5.1095 4.8967 4.2774 3.0112 4.0543 4.4901 4.0432 5.7106 6.6124 1.2662 3.7262 3.4050 6.1142 4.6527 8.3083 5.6612 1.3801 4.1131 1.5111 1.1516 2.8773 1.4769 1.3444 3.0977 1.3186 1.8122 2.2954 2.5110 1.3211 2.7226 1.5053 1.7829 4.6465 2.0727 1.3716 1.4381 1.8871 4.0121 1.1859 4.0657 1.2900 5.1755 1.0436 1.0497 1.0526 2.3698 1.0586 2.4153 7.2946 5.4709 5.1215 1.0831 1.0348 1.0364 1.1009 1.1000 1.1010 1.1002 1.0909 1.0907 1.0945 1.0960 1.0762
irintensity: 0.3245 0.0589 5.5626 1.1549 1.0970 0.2219 2.6434 0.5660 0.1574 4.6060 3.1368 10.3397 0.0580 0.0657 6.2476 0.0002 0.3340 8.6361 10.7887 0.7550 1.7365 24.2285 47.3150 8.2214 2.2581 7.5700 17.1931 3.5819 29.2316 7.1603 69.7340 7.5367 22.6544 0.3658 0.8618 0.1039 0.2893 31.3167 5.8306 0.5045 17.8987 248.1073 207.0208 0.3094 428.6616 38.2445 0.0807 51.5073 7.8779 89.5344 14.8203 209.3147 88.8974 29.2178 5.5441 3.5761 23.6630 0.5688 25.4033 435.6364 58.8576 166.1705 82.8838 37.6070 33.0249 24.6926 20.5202 52.5618 2.4061 35.1976 12.7551 2.2614 2.8396 5.3007 18.2681
temp: 298.150 k
press: 1.00000 atm
elementType: 8 8 8 7 7 6 6 6 6 6 6 6 6 6 6 1 1 1 1 1 1 1 1 1 1 1 1
symmnumber: 1
zpe: 550269.0 jmol-1
zpe.correction: 0.209586 hartree
zpe.thermalcorrener: 0.224062 hartree
zpe.thermalcorrenthalpy: 0.225006 hartree
zpe.thermalcorrgfe: 0.166483 hartree
zpe.sumelectzpe: -722.270330 hartree
zpe.sumelectthermal: -722.255854 hartree
zpe.sumelectthermalent: -722.254910 hartree
zpe.sumelectthermalfe: -722.313434 hartree
dipole: -6.9801 4.1816 -0.0024
dipole: 8.1368
quadrupole: -110.9465 -85.3325 -88.8490
quadrupole: -5.8045 -0.1633 -0.0836
quadrupole: -15.9039 9.7102 6.1937 -5.8045 -0.1633 -0.0836
hfenergy: -722.4799164 hartree
pointgroup: C01 [X(C10H12N2O3)]
dipole: -2.7383721 -1.595457 0.4515288 debye
polarizability: 247.3957542|1.5876596|126.0313171|4.5307453|-18.2229474|78.632598 unknown
InChI: InChI=1S/C10H12N2O3/c1-7(2)10(13)11-8-3-5-9(6-4-8)12(14)15/h3-7,11H,1-2H3
charge 0 multiplicity 1
27 atoms
O  -2.504658 1.364429 -0.547359
O  4.819955 -0.772123 0.375923
O  4.498588 1.362612 -0.367354
N  -1.573179 -0.671199 0.164649
N  4.056671 0.210074 0.017923
C  -4.040048 -0.46952 0.006651
C  -2.651698 0.172366 -0.153905
C  -4.867392 0.348919 1.031005
C  -4.743848 -0.506582 -1.375257
C  -0.18527 -0.398184 0.112429
C  0.70317 -1.445433 0.495743
C  0.342203 0.858869 -0.302616
C  2.596346 0.000589 0.051607
C  2.091262 -1.25277 0.467425
C  1.733826 1.051815 -0.331203
H  -3.934232 -1.509122 0.381251
H  -4.400476 0.345417 2.032576
H  -5.884544 -0.072325 1.121326
H  -4.948645 1.39651 0.693104
H  -5.759957 -0.927644 -1.273442
H  -4.185403 -1.121276 -2.104392
H  -4.825636 0.517231 -1.779532
H  -1.826392 -1.613229 0.473762
H  0.299473 -2.413675 0.816481
H  -0.344321 1.655037 -0.593308
H  2.787783 -2.04343 0.757023
H  2.163321 2.006345 -0.64661
