program: Gaussian 09
title: 000225833
version: EM64L-G09RevD.01
frameworkgroup: C1[X(C10H12ClNO)]
method: RPBEPBE
basis: SDD
operation: Freq
keyword: #p
keyword: freq=noraman
keyword: PBEPBE/SDD
title: #p freq=noraman PBEPBE/SDD
converged: YES YES NO NO
title: Mulliken charges:
elementType: Cl O N C C C C C C C C C C H H H H H H H H H H H H
charge: -0.076819 -0.254150 -0.450497 -0.219341 0.219967 -0.680252 -0.680298 0.596491 -0.360458 -0.323837 -0.221613 -0.223539 -0.241585 0.206332 0.218702 0.216646 0.244996 0.216694 0.218663 0.245035 0.309515 0.315247 0.255153 0.233141 0.235806
chargesum: 0.00000
title: Mulliken charges with hydrogens summed into heavy atoms:
elementType: Cl O N C C C C C C C C C C
charge: -0.076819 -0.254150 -0.140982 -0.013009 0.219967 0.000091 0.000094 0.596491 -0.360458 -0.008590 0.033540 0.009603 -0.005779
polarizability: 1.80524359e+02 7.04081847e+00 1.38375832e+02 -2.36693615e-02 1.59774304e-02 7.01091249e+01
1716.lowfreq: -8.0253 -7.7374 -0.0025 -0.0021 -0.0002 2.0304 21.5012 45.0100 86.0662
frequency: 20.5512 44.8644 86.0585 104.1837 154.1821 194.6834 206.1138 229.9830 230.8786 260.4454 303.6519 309.9008 358.2298 409.9351 423.1651 440.7558 542.9858 585.3954 656.9654 672.8161 692.2229 718.2945 730.7890 762.5773 814.9130 868.1938 874.7702 924.0272 930.3891 951.1692 963.4686 998.5074 1006.2682 1037.8597 1095.1554 1106.6978 1124.7222 1150.5424 1171.3616 1186.4949 1244.0907 1290.0012 1298.8069 1343.2179 1372.0554 1376.4292 1395.7503 1425.2562 1454.7481 1461.0077 1472.4774 1476.9786 1491.1461 1507.8707 1576.1338 1609.7111 1626.4990 2973.7889 2984.5167 2986.7864 3079.7878 3083.8532 3092.3148 3098.0671 3142.0105 3158.4175 3175.7516 3190.7875 3489.4637
redmass: 3.1835 4.2844 5.1299 4.9904 4.5631 1.0934 3.1245 3.3287 1.6092 2.6999 3.7663 4.3642 5.9284 4.1928 4.7662 3.4380 3.4731 5.6620 3.7830 4.6709 1.3154 5.9532 2.9258 1.2883 5.1748 4.0226 1.3439 1.1530 2.9455 1.3540 1.4747 1.3102 7.0410 2.0371 1.5210 2.5332 1.6560 2.3278 1.0673 2.0049 1.5800 1.3602 1.9526 1.7284 4.2544 1.1879 1.2329 2.6084 2.3783 1.0435 1.0496 1.0508 1.0598 2.3654 5.5350 6.9781 4.6539 1.0815 1.0347 1.0380 1.1008 1.0999 1.1009 1.1001 1.0866 1.0919 1.0983 1.0958 1.0761
irintensity: 0.6191 4.5268 1.4780 2.6296 0.7611 0.6277 1.2184 5.7756 1.8404 0.0096 10.7332 0.2513 8.1053 0.5700 3.2562 10.2678 3.6820 4.6748 9.9687 12.4940 40.3535 0.1835 4.5243 118.9904 0.7389 7.8685 4.3986 6.6683 21.7974 5.7489 0.1960 3.3886 50.7013 3.8313 13.1054 0.3516 6.5568 77.4585 0.5470 26.1486 9.3426 0.1069 56.0608 22.3883 91.6181 15.1523 36.0374 99.3143 16.5681 4.9907 3.5020 20.7671 18.0369 443.3976 13.6749 95.7589 59.1239 34.2700 34.9170 23.6889 20.4983 54.3532 2.8689 37.1883 3.8881 11.5510 8.6086 12.2157 41.0562
temp: 298.150 k
press: 1.00000 atm
elementType: 17 8 7 6 6 6 6 6 6 6 6 6 6 1 1 1 1 1 1 1 1 1 1 1 1
symmnumber: 1
zpe: 521702.8 jmol-1
zpe.correction: 0.198706 hartree
zpe.thermalcorrener: 0.211825 hartree
zpe.thermalcorrenthalpy: 0.212769 hartree
zpe.thermalcorrgfe: 0.157619 hartree
zpe.sumelectzpe: -977.357185 hartree
zpe.sumelectthermal: -977.344066 hartree
zpe.sumelectthermalent: -977.343122 hartree
zpe.sumelectthermalfe: -977.398273 hartree
dipole: -0.4251 1.5920 0.0062
dipole: 1.6477
quadrupole: -72.9693 -85.8782 -87.2442
quadrupole: 9.6388 0.0026 -0.0073
quadrupole: 9.0612 -3.8476 -5.2136 9.6388 0.0026 -0.0073
hfenergy: -977.5558912 hartree
pointgroup: C01 [X(C10H12Cl1N1O1)]
dipole: 0.1312405 -0.607783 0.1834001 debye
dipolederiv: -0.1961329 -0.1357759 0.0307244 -0.0815122 -0.6839925 0.1718658 0.0152941 0.1687188 -0.1106086 -0.7695384 -0.0572216 -0.0082742 0.4536696 -0.8030938 0.1561499 -0.1543901 0.1257021 -0.3976823 -1.9257908 0.146359 -0.1403377 0.2383292 -0.3979827 0.0502584 -0.1657605 0.044646 -0.2947252 -0.1863104 -0.0949923 0.0126213 -0.0735053 0.0836451 -0.0118218 0.0060453 -0.0130881 0.0625289 1.886071 -0.1201671 0.1385911 -0.7823454 0.923605 -0.2738574 0.3272243 -0.2343466 0.2170001 0.0067135 0.0332589 0.0262998 -0.0781539 0.0126421 -0.0165605 -0.0346916 -0.0455249 0.011468 0.0041078 0.0097495 -0.0375667 -0.0482763 0.0391448 -0.0080509 0.0726681 0.0310921 -0.0124666 1.1136865 0.0229442 0.0519177 0.4491932 -0.1570168 0.1090364 -0.0704038 0.0837261 0.1035976 -0.1030148 0.163839 -0.0459172 0.171499 0.9354891 -0.2880431 -0.0481721 -0.2886462 -0.032493 -0.2201403 0.0757265 -0.0255642 -0.228613 -0.0648116 -0.038809 0.0613179 -0.0206148 -0.1438717 -0.0013578 -0.0206865 0.0111861 -0.1056362 -0.1472919 0.0101124 0.0354529 0.0152716 -0.0913145 0.0502571 -0.0146546 0.0160911 0.0733783 0.1312067 -0.0752094 -0.0090359 -0.0805671 -0.1253869 -0.0438431 0.0094997 0.0055801 0.043933 -0.0708403 -0.0285144 -0.0042003 -0.0306056 -0.17179 -0.0190723 0.0926086 -0.0292882 0.0684393 -0.1455157 0.053344 -0.0222429 0.0546925 0.0086168 0.0570616 0.0117639 -0.1137899 0.0145235 0.0868024 -0.006708 -0.0729622 -0.0210388 -0.1381574 -0.1608883 -0.097213 0.0501635 -0.1096241 0.0298917 0.0022743 0.0392128 -0.010084 0.083471 0.107655 0.024322 0.0111241 0.0789292 -0.0738529 0.0214262 -0.0272345 0.0736001 0.0722434 -0.1548443 -0.1181473 -0.0158579 -0.1213537 0.0414695 0.0066379 -0.000565 0.0197969 0.0657534 0.0351475 0.0800647 0.106864 0.0622114 0.0395834 -0.0933469 0.0703717 -0.0779068 -0.069247 0.1089292 0.0180051 -0.0206894 0.0785017 -0.0723048 0.0795803 -0.0154873 0.0205071 0.0693178 0.2524469 -0.0369663 0.0092435 -0.0997435 0.1849633 0.0194766 0.0274196 0.0232038 0.2686682 0.1584612 0.0422482 -0.0133227 0.0333958 0.0848908 0.02893 -0.0106809 0.0294904 0.1704849 0.0307207 0.0613168 -0.0256261 0.0812899 0.0339436 0.0425148 -0.031362 0.0412849 0.1521655 0.0683646 -0.0396152 0.0059158 -0.0649276 -0.0772505 0.0632387 0.0130806 0.064746 0.1404584 -0.0986893 -0.0562663 -0.0000883 -0.0536017 0.0666761 0.0260758 -0.0008982 0.0259444 0.1619693 unknown
polarizability: 180.8185628|6.1777569|132.804474|4.8548841|-17.4987298|75.3862788 unknown
InChI: InChI=1S/C10H12ClNO/c1-7(2)10(13)12-9-6-4-3-5-8(9)11/h3-7,12H,1-2H3
charge 0 multiplicity 1
25 atoms
Cl 1.435575 -2.625395 0.832746
O  -1.713683 1.484871 -0.528236
N  -0.523094 -0.444275 0.094551
C  -2.991042 -0.549317 -0.02054
C  -1.695899 0.267568 -0.178494
C  -3.877412 0.105688 1.069801
C  -3.731296 -0.600003 -1.382011
C  0.81744 0.009187 0.044766
C  1.866449 -0.896636 0.365986
C  1.186281 1.337329 -0.311817
C  3.22033 -0.531464 0.343357
C  2.544689 1.714388 -0.337839
C  3.565817 0.792719 -0.013595
H  -2.745758 -1.585248 0.292107
H  -3.37804 0.10874 2.055653
H  -4.831741 -0.442802 1.166048
H  -4.097903 1.151143 0.792231
H  -4.686817 -1.144874 -1.277128
H  -3.127413 -1.105527 -2.157347
H  -3.946178 0.426081 -1.727909
H  -0.635445 -1.4257 0.368322
H  0.390601 2.042131 -0.560084
H  3.988635 -1.266585 0.599398
H  2.803938 2.741577 -0.615181
H  4.618666 1.090798 -0.035184
