program: Gaussian 09
title: 000225854
version: EM64L-G09RevD.01
frameworkgroup: C1[X(C12H14N2O5)]
method: RPBEPBE
basis: SDD
operation: Freq
keyword: #p
keyword: freq=noraman
keyword: PBEPBE/SDD
title: #p freq=noraman PBEPBE/SDD
converged: YES YES NO NO
title: Mulliken charges:
elementType: O O O O O N N C C C C C C C C C C C C H H H H H H H H H H H H H H
charge: -0.246238 -0.254220 -0.249935 -0.207201 -0.201762 -0.107350 0.015113 0.228270 0.132355 -0.337901 -0.341512 0.278107 0.168097 -0.433115 0.242759 -0.528510 -0.656482 -0.658014 -0.203792 0.200529 0.252598 0.227901 0.234619 0.283350 0.308956 0.266697 0.207245 0.212928 0.228272 0.217273 0.221820 0.249079 0.250064
chargesum: 0.00000
title: Mulliken charges with hydrogens summed into heavy atoms:
elementType: O O O O O N N C C C C C C C C C C C C
charge: -0.246238 -0.254220 -0.249935 -0.207201 -0.201762 -0.107350 0.015113 0.228270 0.132355 0.115226 0.121008 0.278107 0.168097 -0.149765 0.242759 -0.219554 0.030389 0.009351 0.295350
polarizability: 2.36042379e+02 1.29715169e+01 1.72251629e+02 -1.16184416e+00 7.99843935e+00 1.12927969e+02
1716.lowfreq: -12.8592 -3.6455 -0.0002 0.0007 0.0011 6.0644 30.1897 42.0215 50.9921
frequency: 29.8305 41.9726 50.9511 60.7041 64.5870 71.3225 82.9571 108.7693 131.5044 170.0903 179.5040 191.0363 197.7744 224.7245 258.2356 284.3866 307.3357 332.6119 337.7505 377.3309 390.3283 415.9231 460.4964 494.8517 541.8462 599.6754 622.9590 651.0493 672.6713 685.1162 694.5080 727.1613 738.6093 755.0230 770.3221 773.1596 797.0497 834.1509 847.2393 880.7012 901.8884 939.2983 958.8755 972.1994 1012.6759 1064.2439 1070.0428 1079.0963 1084.5245 1100.7781 1101.8709 1122.9048 1170.9285 1205.9752 1212.0670 1223.3024 1243.5618 1273.3667 1298.8640 1339.3283 1348.3538 1355.0772 1364.1963 1375.8494 1387.1486 1388.8308 1411.0438 1442.3738 1453.3102 1464.1990 1466.6505 1469.4497 1470.1590 1480.1311 1483.3668 1484.7735 1569.2022 1609.0980 1615.4229 2985.1125 2990.0275 2996.7535 3011.4031 3024.9906 3062.9333 3070.3077 3084.5561 3086.8211 3092.2535 3109.4383 3116.7863 3181.0643 3203.8155
redmass: 4.4804 4.6667 3.8959 2.6582 2.6393 5.7665 3.5476 6.4911 5.0786 4.2818 3.1020 1.4267 1.9637 1.9344 4.3632 6.9055 2.8913 3.1922 10.3702 4.3804 5.8680 3.0029 5.1427 3.7774 7.1458 4.9590 5.7399 9.6548 6.8608 8.9350 7.9672 6.2504 6.5269 8.3652 1.4183 1.1754 3.9133 7.9424 2.7842 1.4773 1.4033 2.2091 3.6901 6.0833 2.8672 1.4651 2.1276 1.9330 1.8535 4.0205 1.7647 1.0604 2.2946 7.1264 2.7129 1.4820 2.6347 1.8747 1.4126 1.3482 3.0168 1.3786 1.8634 3.7772 1.2158 1.2210 3.1883 5.6342 1.1079 1.0715 1.9468 1.1799 1.0862 1.0589 1.0684 1.3916 6.7854 10.1635 8.2488 1.0354 1.0363 1.0654 1.0614 1.0559 1.0969 1.1010 1.0986 1.0999 1.1015 1.1015 1.1167 1.0934 1.0935
irintensity: 1.3282 1.5609 1.8092 8.0337 1.9597 1.8838 1.3480 4.9957 0.9252 0.3630 2.2942 1.0795 0.2462 1.7676 0.7782 2.9231 5.1215 7.2844 0.1197 2.4890 6.9801 8.3827 7.2136 8.0781 14.8318 15.5882 3.1944 3.1766 2.6683 2.4716 3.9917 12.4541 3.1766 7.6782 5.1878 7.8946 17.7633 28.1486 28.9221 6.3816 42.7509 10.8496 14.6853 159.5213 14.2146 6.1210 10.7609 0.8305 52.1870 20.0083 19.3428 1.5092 24.1971 329.2314 21.8496 32.0705 113.2610 243.6221 55.1940 14.6253 81.3311 14.7171 58.1031 11.8492 8.7384 37.7897 148.5162 38.9822 23.1565 10.0019 135.3416 42.6813 13.5942 3.0502 21.5104 62.0718 302.4373 21.8006 21.5185 21.6504 22.1270 25.5217 38.1316 104.5290 2.7205 6.6069 39.2856 43.8035 46.6705 27.8227 21.6074 0.5171 9.8326
temp: 298.150 k
press: 1.00000 atm
elementType: 8 8 8 8 8 7 7 6 6 6 6 6 6 6 6 6 6 6 6 1 1 1 1 1 1 1 1 1 1 1 1 1 1
symmnumber: 1
zpe: 657269.7 jmol-1
zpe.correction: 0.250341 hartree
zpe.thermalcorrener: 0.269048 hartree
zpe.thermalcorrenthalpy: 0.269993 hartree
zpe.thermalcorrgfe: 0.201717 hartree
zpe.sumelectzpe: -949.778287 hartree
zpe.sumelectthermal: -949.759580 hartree
zpe.sumelectthermalent: -949.758635 hartree
zpe.sumelectthermalfe: -949.826911 hartree
dipole: -2.7139 -5.5668 2.7056
dipole: 6.7583
quadrupole: -87.5709 -121.5991 -115.8362
quadrupole: -2.6401 6.2787 -2.2327
quadrupole: 20.7645 -13.2637 -7.5008 -2.6401 6.2787 -2.2327
hfenergy: -950.0286281 hartree
pointgroup: C01 [X(C12H14N2O5)]
dipole: -1.2356436 -2.1426557 0.9757327 debye
polarizability: 237.1194115|8.8486737|170.7005513|4.947015|9.3986836|113.4020134 unknown
InChI: InChI=1S/C12H14N2O5/c1-3-13(4-2)12(15)8-5-10-11(19-7-18-10)6-9(8)14(16)17/h5-6H,3-4,7H2,1-2H3
charge 0 multiplicity 1
33 atoms
O  -3.390517 -1.671069 -0.543485
O  -4.157309 0.481489 0.195205
O  1.737118 -0.011758 -1.933564
O  -0.000722 3.481192 0.661389
O  1.721067 1.98584 0.610621
N  2.273092 -0.99092 0.118569
N  0.467582 2.288414 0.490215
C  -0.004297 -0.0548 -0.28365
C  1.42953 -0.316099 -0.736009
C  3.650298 -1.279601 -0.356465
C  1.978348 -1.202129 1.552392
C  -0.482004 1.207746 0.164136
C  -2.302422 -0.801574 -0.359661
C  -0.949641 -1.0849 -0.551417
C  -2.750343 0.470229 0.073931
C  -1.864065 1.503308 0.344164
C  4.608547 -0.088332 -0.141737
C  1.680383 -2.675104 1.902488
C  -4.611873 -0.843882 -0.300896
H  4.011146 -2.179177 0.175459
H  3.587921 -1.514754 -1.432658
H  2.843392 -0.836731 2.138576
H  1.121111 -0.566827 1.832215
H  -0.621187 -2.057501 -0.925046
H  -2.17554 2.493792 0.679216
H  4.244932 0.794113 -0.693065
H  4.692816 0.181432 0.926425
H  5.618208 -0.34368 -0.512114
H  0.77515 -3.028854 1.378051
H  2.519981 -3.336309 1.622221
H  1.514289 -2.781466 2.990159
H  -5.144623 -0.711524 -1.258597
H  -5.221967 -1.331263 0.475332
