program: Gaussian 09
title: 000225841
version: EM64L-G09RevD.01
frameworkgroup: C1[X(C10H20O4)]
method: RPBEPBE
basis: SDD
operation: Freq
keyword: #pfreq=noraman
keyword: PBEPBE/SDD
title: #p freq=noraman PBEPBE/SDD
converged: YES YES NO NO
title: Mulliken charges:
elementType: O O O O C C C C C C C C C C H H H H H H H H H H H H H H H H H H H H
charge: -0.296796 -0.257619 -0.261136 -0.249377 0.051290 -0.403371 -0.307712 -0.715117 -0.512011 -0.289421 0.260425 -0.506231 -0.211318 -0.676593 0.180828 0.220418 0.228911 0.262508 0.217826 0.219614 0.227668 0.218595 0.247425 0.244159 0.181266 0.251444 0.197821 0.233578 0.207292 0.183717 0.192213 0.201730 0.228564 0.229410
chargesum: 0.00000
title: Mulliken charges with hydrogens summed into heavy atoms:
elementType: O O O O C C C C C C C C C C
charge: -0.296796 -0.257619 -0.261136 -0.249377 0.232118 0.045958 0.172622 -0.049240 -0.020428 0.143289 0.260425 0.132460 0.164612 -0.016888
polarizability: 1.64203787e+02 3.49933807e+00 1.03220340e+02 -2.91184757e-02 1.49573038e+00 1.09083438e+02
1716.lowfreq: -5.5023 -3.0358 -0.0003 0.0006 0.0008 4.3254 12.6008 26.6392 29.1226
frequency: 12.2541 26.2370 28.9022 51.2897 53.1372 61.1891 83.7491 100.1945 102.8757 158.9471 186.1520 194.1224 224.7877 231.1375 255.8600 263.4702 286.4861 293.6978 329.7830 379.2583 423.5168 463.2678 490.0713 518.6520 613.1186 681.3617 744.4623 792.0299 796.3550 812.4912 814.7986 844.0671 909.6741 940.0357 963.0457 997.3791 1019.0665 1028.2321 1050.6686 1056.8175 1064.0703 1097.2210 1106.8466 1111.8158 1117.1897 1134.4845 1139.2439 1158.6199 1168.6390 1208.9770 1225.7585 1251.1321 1277.9481 1278.6627 1287.3400 1307.1170 1332.7377 1344.5904 1361.1937 1370.8455 1379.1690 1380.4648 1393.9571 1436.5720 1448.4116 1450.1790 1456.8200 1458.2692 1462.0812 1466.9362 1467.8213 1478.9608 1478.9960 1481.4802 1492.8872 1631.3084 2909.4609 2924.2881 2930.0780 2943.7512 2975.7132 2983.9150 2994.1021 3006.4736 3009.2370 3012.5532 3024.9813 3069.5335 3079.5704 3080.2650 3088.7187 3092.0096 3097.1554 3101.0459 3101.8237 3133.8838
redmass: 4.0374 3.6032 2.5613 3.4803 2.6742 3.5288 2.4859 2.9365 2.8037 2.4682 2.3823 1.2367 1.3393 1.4090 3.4330 2.3506 2.6873 2.7559 3.8079 3.1347 3.6004 2.8539 3.5796 2.8555 4.3113 3.9938 2.2548 1.9339 1.6764 1.5358 1.1402 3.5310 1.7234 6.2349 1.5767 2.8216 3.5361 4.0154 2.3459 3.8206 4.2147 2.0989 2.0926 1.6069 1.5708 1.4718 1.8596 2.6917 1.7146 1.3044 1.3552 1.1656 1.2693 1.1515 1.1179 1.4315 1.2029 1.3867 1.2468 1.5113 1.2793 1.2352 1.2810 1.1303 1.0875 1.0881 1.0564 1.0410 1.0859 1.0629 1.0853 1.0498 1.0539 1.0527 1.0795 9.0395 1.0833 1.0559 1.0352 1.0685 1.1055 1.0362 1.0358 1.0604 1.0998 1.0618 1.0633 1.1015 1.0948 1.0987 1.1003 1.0991 1.0976 1.0997 1.1006 1.1029
irintensity: 0.1316 0.9564 2.4794 0.1189 0.7349 3.8706 2.9855 0.5092 1.3537 1.7700 4.4003 3.8694 0.8867 2.3052 2.4440 2.3146 10.4841 14.9686 5.6190 12.4432 8.4937 0.7758 1.6623 1.9657 10.4895 5.6164 2.5458 22.6528 3.0095 3.2690 3.7802 3.5161 10.9780 76.7734 3.2263 59.9481 5.4167 20.9930 4.3931 113.5566 222.0042 37.4890 5.0029 4.0214 9.9780 13.5212 70.9849 137.8043 44.0024 13.7093 20.1926 4.6782 6.7696 35.0284 1.3764 79.2916 13.2314 21.2262 43.2022 9.4950 17.1082 17.9911 21.2667 3.0307 8.0475 2.6709 6.8432 10.1904 17.2996 10.9377 11.4634 6.5556 15.1052 11.6749 6.5726 158.9498 49.6391 52.7341 86.8837 64.3340 52.0781 15.0733 26.0341 5.3219 77.5679 10.7437 35.4402 5.1692 1.5195 43.6001 32.4923 32.0437 30.8571 27.9207 35.3373 10.6416
temp: 298.150 k
press: 1.00000 atm
elementType: 8 8 8 8 6 6 6 6 6 6 6 6 6 6 1 1 1 1 1 1 1 1 1 1 1 1 1 1 1 1 1 1 1 1
symmnumber: 1
zpe: 762918.1 jmol-1
zpe.correction: 0.290580 hartree
zpe.thermalcorrener: 0.308602 hartree
zpe.thermalcorrenthalpy: 0.309547 hartree
zpe.thermalcorrgfe: 0.240548 hartree
zpe.sumelectzpe: -692.765767 hartree
zpe.sumelectthermal: -692.747744 hartree
zpe.sumelectthermalent: -692.746800 hartree
zpe.sumelectthermalfe: -692.815799 hartree
dipole: -2.3613 1.2628 -1.3583
dipole: 3.0025
quadrupole: -72.5809 -83.9039 -92.5855
quadrupole: 3.4700 -11.3263 2.1574
quadrupole: 10.4425 -0.8804 -9.5621 3.4700 -11.3263 2.1574
hfenergy: -693.0563468 hartree
pointgroup: C01 [X(C10H20O4)]
dipole: 0.9646908 -0.3120512 -0.6061619 debye
polarizability: 163.6507505|6.1531462|104.679466|2.8394315|-2.4434506|108.1773484 unknown
InChI: InChI=1S/C10H20O4/c1-4-13-7-6-10(11)14-8-5-9(2)12-3/h9H,4-8H2,1-3H3
charge 0 multiplicity 1
34 atoms
O  4.321355 0.378745 -0.692073
O  0.150956 0.935716 -0.367882
O  -4.389618 -0.483139 0.377651
O  -0.406643 0.499913 1.85787
C  3.68536 -0.444199 0.361267
C  2.183445 -0.449166 0.023511
C  1.600137 0.969857 0.005578
C  4.269877 -1.867919 0.417067
C  -2.181906 0.684994 0.152835
C  -2.962683 -0.543801 0.688625
C  -0.753798 0.69049 0.667113
C  5.70617 0.74843 -0.40784
C  -4.709714 -0.758516 -1.0334
C  -6.229086 -0.89212 -1.134638
H  3.843821 0.0592 1.34509
H  2.043408 -0.917736 -0.96859
H  1.650183 -1.059614 0.774806
H  2.070763 1.583437 -0.775089
H  1.697746 1.453333 0.995037
H  3.748241 -2.466573 1.186242
H  4.147424 -2.370103 -0.559438
H  5.344441 -1.860407 0.672662
H  -2.691102 1.594179 0.525975
H  -2.173721 0.723564 -0.948183
H  -2.518233 -1.48294 0.28998
H  -2.90372 -0.564109 1.788801
H  5.801408 1.231507 0.588784
H  5.994301 1.4691 -1.189935
H  6.392117 -0.122022 -0.450686
H  -4.202532 -1.696824 -1.352809
H  -4.345087 0.067132 -1.681862
H  -6.532957 -1.085128 -2.179778
H  -6.58611 -1.72324 -0.502667
H  -6.719144 0.035757 -0.792421
