program: Gaussian 09
title: 000225848
version: EM64L-G09RevD.01
frameworkgroup: C1[X(C11H17O6P)]
method: RPBEPBE
basis: SDD
operation: Freq
keyword: #p
keyword: freq=noraman
keyword: PBEPBE/SDD
title: #p freq=noraman PBEPBE/SDD
converged: YES YES NO NO
title: Mulliken charges:
elementType: P O O O O O O C C C C C C C C C C C H H H H H H H H H H H H H H H H H
charge: 1.273380 -0.482220 -0.536555 -0.389931 -0.310452 -0.624099 -0.300793 -0.660780 0.456824 -0.018450 -0.356640 0.243274 -0.236491 -0.358044 -0.508376 -0.478102 -0.546770 -0.527245 0.335788 0.274409 0.234581 0.255758 0.363376 0.257105 0.244014 0.224894 0.229226 0.233579 0.254891 0.266335 0.247742 0.227646 0.222658 0.259391 0.230076
chargesum: 0.00000
title: Mulliken charges with hydrogens summed into heavy atoms:
elementType: P O O O O O O C C C C C C C C C C C
charge: 1.273380 -0.482220 -0.536555 -0.026555 -0.310452 -0.624099 -0.300793 -0.324992 0.456824 -0.018450 -0.082231 0.243274 -0.001910 -0.102286 0.217637 0.239594 0.194953 0.184880
polarizability: 1.97985814e+02 1.04136637e+00 1.71095722e+02 1.11248986e+01 7.69036290e+00 1.27073330e+02
1716.lowfreq: -8.9631 -1.5027 0.0010 0.0011 0.0013 6.9966 21.0542 38.1308 45.0561
frequency: 20.0252 38.0958 44.9194 59.6494 73.2444 81.2226 86.1116 103.6267 105.1818 115.2302 131.8666 143.5606 159.6390 168.8757 172.1506 187.3930 189.9088 213.7951 240.1538 254.1787 272.2707 318.2312 326.3578 332.8980 350.1740 363.2298 413.8875 432.4613 468.6515 529.2207 552.0172 568.1472 601.9895 622.3888 661.8315 697.9053 708.0554 760.6621 779.4393 814.6221 878.5102 907.3723 935.7274 951.9435 962.4458 968.5078 973.5682 1009.7357 1037.1882 1065.0369 1112.6677 1112.7553 1112.9047 1125.6246 1131.9835 1134.5629 1144.7400 1154.0809 1166.7674 1178.5960 1220.8429 1239.1970 1251.3701 1264.5287 1364.0058 1385.6969 1418.2524 1424.4048 1427.9412 1429.8111 1449.9911 1458.3499 1458.8787 1459.2760 1465.8709 1466.7847 1476.5243 1478.8484 1479.6785 1486.5068 1589.8609 1591.0578 2973.0746 2975.4050 2977.2952 2984.3743 3073.5755 3077.1864 3080.0092 3087.1326 3105.6720 3118.6450 3120.5117 3121.5685 3125.9042 3128.2353 3150.4273 3171.1333 3552.4266
redmass: 4.5709 4.5294 3.7225 3.2951 1.1126 3.0441 3.4058 4.1195 2.7477 4.4474 4.7300 1.2039 2.5560 1.5171 3.7442 1.2278 2.3503 3.9812 4.0364 4.4008 5.1987 3.1417 2.6741 4.0340 4.4647 3.8483 6.0253 5.6092 7.3234 6.1697 4.0057 5.8820 5.7982 6.5434 8.9173 4.9372 6.4287 1.7345 5.5970 2.7740 4.5179 1.5210 9.2545 7.4103 10.0858 9.2544 1.3876 4.2048 13.1230 2.0800 1.2373 1.2462 1.2449 1.2440 1.2897 1.3009 1.5464 1.3479 2.1506 1.2457 1.4865 1.8592 1.5304 2.4517 4.5953 1.2692 1.3128 1.1260 1.1233 1.3169 1.8181 1.2474 1.4479 1.2364 1.0600 1.0824 1.0533 1.0564 1.0621 1.0524 7.0532 6.4633 1.0306 1.0296 1.0313 1.0290 1.1051 1.1028 1.1060 1.1055 1.0856 1.1017 1.1040 1.1032 1.1035 1.0890 1.0909 1.0985 1.0663
irintensity: 1.6860 0.4665 0.9213 3.6074 0.3300 3.6773 2.9525 4.9504 7.6719 8.4774 1.7804 0.6433 5.4913 6.2676 17.8377 1.5699 10.8101 5.2056 16.0579 1.5365 14.6634 15.9189 119.9878 15.2174 9.9105 30.5180 16.9475 3.7597 43.5285 7.7999 2.0140 44.3443 27.6720 71.7963 122.6133 7.2759 12.2667 49.2677 5.5923 35.6574 39.4650 11.0730 67.7677 45.6549 223.4176 129.1657 4.2347 75.9945 96.0338 36.6856 8.5055 1.6081 1.6887 3.3286 0.5150 1.1595 12.6849 0.9171 31.5786 5.8183 109.2746 29.8508 19.4924 75.3582 17.4811 19.2574 8.0419 2.6900 4.4702 3.8299 89.8099 25.7524 4.5945 9.7157 13.2487 0.7952 18.4694 16.6439 7.0001 15.5275 14.2137 0.9954 43.9751 47.3288 77.4399 58.7966 25.6226 24.0841 11.9045 25.2899 8.2604 16.1509 15.6973 20.5331 20.2387 2.9436 5.6795 11.3548 19.6663
temp: 298.150 k
press: 1.00000 atm
elementType: 15 8 8 8 8 8 8 6 6 6 6 6 6 6 6 6 6 6 1 1 1 1 1 1 1 1 1 1 1 1 1 1 1 1 1
symmnumber: 1
zpe: 707819.9 jmol-1
zpe.correction: 0.269594 hartree
zpe.thermalcorrener: 0.291611 hartree
zpe.thermalcorrenthalpy: 0.292555 hartree
zpe.thermalcorrgfe: 0.217114 hartree
zpe.sumelectzpe: -1220.459214 hartree
zpe.sumelectthermal: -1220.437198 hartree
zpe.sumelectthermalent: -1220.436253 hartree
zpe.sumelectthermalfe: -1220.511694 hartree
dipole: 2.5512 -3.1274 -0.1630
dipole: 4.0393
quadrupole: -115.3983 -103.9652 -112.4293
quadrupole: 11.1854 -1.7161 -3.8126
quadrupole: -4.8007 6.6324 -1.8317 11.1854 -1.7161 -3.8126
hfenergy: -1220.7288084 hartree
pointgroup: C01 [X(C11H17O6P1)]
dipole: -0.9521245 1.2215926 -0.3558931 debye
polarizability: 198.2813135|-2.3292487|165.7279731|-10.3437806|-16.1121999|132.1455795 unknown
InChI: InChI=1S/C11H17O6P/c1-14-9-7-5-6-8(10(9)15-2)11(12)18(13,16-3)17-4/h5-7,11-12H,1-4H3
charge 0 multiplicity 1
35 atoms
P  2.421145 -0.283835 0.289249
O  3.884271 0.010244 -0.605845
O  2.023838 1.247953 1.039284
O  1.365722 -1.333105 -2.025535
O  -1.164148 1.482734 -1.024803
O  2.632465 -1.502697 1.292988
O  -3.713947 0.879485 0.214997
C  0.979991 -0.390679 -0.981086
C  -0.331232 -0.695863 -0.296226
C  -1.383603 0.254528 -0.356499
C  -0.531429 -1.919921 0.39365
C  -2.648077 -0.044036 0.225373
C  -1.776413 -2.198245 0.995734
C  -2.834356 -1.2669 0.905373
C  3.857401 0.939949 -1.756558
C  2.623802 1.53998 2.362843
C  -1.025924 2.642378 -0.100403
C  -4.203776 1.281073 -1.126099
H  0.92549 0.589847 -1.473677
H  0.300817 -2.624601 0.507513
H  -1.923074 -3.135611 1.541826
H  -3.811593 -1.462158 1.358105
H  1.250836 -2.262292 -1.697796
H  3.229506 0.532708 -2.569627
H  4.903836 0.998922 -2.092049
H  3.503456 1.943971 -1.45512
H  2.009454 2.346615 2.791336
H  3.668568 1.877915 2.243924
H  2.588671 0.645359 3.009897
H  -0.125302 2.506036 0.525897
H  -1.930497 2.741519 0.526308
H  -0.912124 3.522327 -0.75185
H  -4.639359 0.406275 -1.644896
H  -3.388004 1.711772 -1.732073
H  -4.985908 2.031058 -0.934654
