program: Gaussian 09
title: 000226167
version: EM64L-G09RevD.01
frameworkgroup: C1[X(C17H18O3)]
method: RPBEPBE
basis: SDD
operation: Freq
keyword: #pfreq=noraman
keyword: PBEPBE/SDD
title: #p freq=noraman PBEPBE/SDD
converged: YES YES NO NO
title: Mulliken charges:
elementType: O O O C C C C C C C C C C C C C C C C C H H H H H H H H H H H H H H H H H H
charge: -0.473716 -0.410996 -0.239707 0.062160 -0.382595 0.372395 -0.367420 0.096303 -0.412707 -0.380445 0.354921 -0.700516 -0.394464 -0.412830 0.338377 -0.397126 -0.395895 -0.235869 -0.236447 -0.241723 0.222604 0.228001 0.240079 0.199171 0.279734 0.258710 0.218943 0.208335 0.214835 0.238793 0.237761 0.366013 0.239223 0.237805 0.387368 0.225868 0.225312 0.229748
chargesum: 0.00000
title: Mulliken charges with hydrogens summed into heavy atoms:
elementType: O O O C C C C C C C C C C C C C C C C C
charge: -0.107703 -0.023628 -0.239707 0.062160 0.068010 0.372395 0.071830 0.096303 -0.132973 -0.121735 0.354921 -0.058402 -0.155672 -0.175069 0.338377 -0.157904 -0.158090 -0.010002 -0.011135 -0.011975
polarizability: 3.05542948e+02 7.01471789e+00 1.54327822e+02 8.07010558e+00 -2.54471498e+01 1.46177182e+02
1716.lowfreq: -11.2376 -5.0508 -0.0010 -0.0008 -0.0006 4.2713 25.8267 33.3573 61.5191
frequency: 25.7768 33.2833 61.3767 65.2990 69.7441 79.0167 87.7337 99.9195 139.9386 185.6834 211.4127 225.6954 237.4134 260.6402 290.0251 316.0156 346.0930 365.8550 391.7572 404.1169 411.4625 416.0033 425.0002 497.0023 509.3696 547.3392 558.7302 601.3626 614.4076 624.1089 637.2141 670.0043 702.1474 718.7291 737.8071 746.8985 749.8421 773.2226 844.4252 848.0437 850.8292 861.1184 882.3340 919.7965 925.6111 967.8692 970.9611 974.0175 987.9260 991.7244 993.9280 996.7369 1018.4194 1035.2783 1041.5207 1059.3082 1073.3798 1084.7230 1113.1275 1118.9279 1157.9295 1173.3843 1178.1459 1191.2213 1208.7599 1244.6562 1275.4912 1288.5298 1289.7696 1298.5156 1306.5297 1314.1216 1350.5717 1353.5811 1364.1755 1374.4297 1390.1743 1409.4829 1437.6412 1444.9242 1474.4541 1474.9401 1478.6780 1484.9870 1510.7207 1565.0044 1588.3324 1612.9468 1616.6011 1630.6319 2973.4838 2977.8471 3001.6975 3038.4717 3062.5503 3074.2873 3078.4483 3122.5643 3126.5381 3131.9965 3134.3508 3140.8460 3148.8524 3156.5267 3165.0347 3171.1091 3469.1063 3505.7536
redmass: 4.2134 4.4180 2.1125 3.8133 4.5330 4.3678 4.5828 3.6273 5.1237 4.6413 5.8539 2.2725 1.3786 4.4643 4.8391 3.2680 3.2400 4.1537 4.3686 2.7180 3.2645 3.2182 1.6167 3.6238 3.5555 2.2911 3.2414 3.1374 6.4140 2.5099 6.8991 3.6326 1.7462 3.9717 1.4594 2.3519 4.2652 2.1150 1.5064 1.4800 1.2672 1.3447 2.9559 1.5111 2.0376 1.3697 2.3880 1.4554 4.1248 1.6665 1.3212 4.3627 2.8205 3.0484 1.9446 2.4730 2.4782 1.6215 2.0245 1.5765 2.0310 1.0550 2.3981 1.1401 1.3087 1.3022 1.5812 1.8129 1.8270 1.1929 1.3855 1.4130 1.7864 1.9755 1.9767 8.4694 1.2113 3.9201 2.3794 1.0969 1.9354 1.1105 1.0421 1.0754 2.7656 6.3202 6.4994 6.0370 6.4524 8.7679 1.0359 1.0634 1.0597 1.0956 1.1013 1.0991 1.1021 1.0844 1.0875 1.0874 1.0891 1.0916 1.0963 1.0952 1.1016 1.0940 1.0649 1.0640
irintensity: 0.2287 0.0835 0.3942 0.4100 1.7761 0.2009 0.1175 0.1159 0.1684 2.8025 1.7918 0.0098 0.3425 1.2580 11.7991 13.3263 30.2865 8.5570 34.8313 4.1909 0.4172 9.2952 53.3953 11.5298 21.6419 22.0503 10.2406 40.7472 0.1848 61.6326 0.4792 85.8967 46.5253 20.4899 9.4709 30.9183 5.5722 53.3562 22.0635 7.0244 1.0806 13.9696 10.9663 0.4270 4.7863 3.8954 24.6439 1.4091 0.9325 3.1944 0.1258 15.0253 10.4796 88.1191 19.7372 155.8589 32.9416 7.8516 9.7272 6.4420 7.0896 0.1200 19.7094 0.5341 0.2933 1.7708 30.1897 19.9569 13.3165 0.3774 8.6622 0.5522 7.9028 0.2381 15.6390 0.0449 9.8508 5.9498 3.9919 5.2816 58.2923 5.0970 12.6859 11.1113 9.0881 2.3838 1.0177 9.4526 13.4257 213.3487 44.2980 19.9697 25.0861 0.3757 2.4586 52.3374 68.2823 8.3272 1.6891 8.8038 13.3925 10.0436 40.0852 9.1399 26.9844 3.6807 47.5325 32.4654
temp: 298.150 k
press: 1.00000 atm
elementType: 8 8 8 6 6 6 6 6 6 6 6 6 6 6 6 6 6 6 6 6 1 1 1 1 1 1 1 1 1 1 1 1 1 1 1 1 1 1
symmnumber: 1
zpe: 803688.6 jmol-1
zpe.correction: 0.306109 hartree
zpe.thermalcorrener: 0.325037 hartree
zpe.thermalcorrenthalpy: 0.325982 hartree
zpe.thermalcorrgfe: 0.257569 hartree
zpe.sumelectzpe: -882.843980 hartree
zpe.sumelectthermal: -882.825051 hartree
zpe.sumelectthermalent: -882.824107 hartree
zpe.sumelectthermalfe: -882.892519 hartree
dipole: -0.4885 1.2211 -1.8299
dipole: 2.2535
quadrupole: -107.9163 -111.6273 -119.3289
quadrupole: 4.7545 -6.1756 -8.9757
quadrupole: 5.0412 1.3302 -6.3714 4.7545 -6.1756 -8.9757
hfenergy: -883.1500887 hartree
pointgroup: C01 [X(C17H18O3)]
dipole: -0.2098789 -0.0766074 -0.8579908 debye
polarizability: 305.7403817|8.6931954|126.059669|-0.8097816|-9.5423236|174.2479014 unknown
InChI: InChI=1S/C17H18O3/c1-2-12-17(20,16(18)19)15-10-8-14(9-11-15)13-6-4-3-5-7-13/h3-11,18,20H,2,12H2,1H3
charge 0 multiplicity 1
38 atoms
O  3.153111 0.549927 1.64698
O  3.220627 1.055741 -1.979701
O  3.634654 2.469273 -0.190072
C  2.730035 0.221944 0.284322
C  3.355799 -1.153739 -0.073329
C  1.183105 0.17007 0.188001
C  4.898103 -1.173259 -0.046705
C  3.244048 1.35996 -0.624681
C  0.404518 0.3093 1.360969
C  0.521716 -0.060736 -1.04512
C  -1.677408 -0.001062 0.072885
C  5.457959 -2.587316 -0.310096
C  -1.001615 0.225971 1.302183
C  -0.883379 -0.144277 -1.098409
C  -3.165139 -0.085869 0.012097
C  -3.912291 -0.629689 1.093835
C  -3.878771 0.376073 -1.128784
C  -5.320048 -0.70852 1.037758
C  -5.286408 0.296612 -1.187227
C  -6.015595 -0.24599 -0.103616
H  2.98487 -1.466361 -1.066581
H  2.958554 -1.873333 0.668051
H  5.240843 -0.805598 0.937657
H  5.294169 -0.474473 -0.811445
H  0.917006 0.478127 2.312242
H  1.103204 -0.173594 -1.9661
H  6.563001 -2.590579 -0.289173
H  5.137375 -2.968462 -1.298306
H  5.104155 -3.302029 0.456535
H  -1.583191 0.36747 2.220225
H  -1.369766 -0.352884 -2.057939
H  3.328034 1.530528 1.686174
H  -3.384919 -1.021432 1.97105
H  -3.329491 0.82867 -1.962313
H  3.522732 1.846478 -2.504532
H  -5.873673 -1.139411 1.879617
H  -5.815033 0.667042 -2.072819
H  -7.108592 -0.307269 -0.147837
