program: Gaussian 09
title: 000225825
version: EM64L-G09RevD.01
frameworkgroup: C1[X(C9H6BrNO2)]
method: RPBEPBE
basis: SDD
operation: Freq
keyword: #p
keyword: freq=noraman
keyword: PBEPBE/SDD
title: #p freq=noraman PBEPBE/SDD
converged: YES YES NO NO
title: Mulliken charges:
elementType: Br O O N C C C C C C C C C H H H H H H
charge: 0.030298 -0.259387 -0.255294 -0.012006 0.201275 0.188765 0.616770 -0.486425 -0.279358 -0.398651 -0.202689 -0.623804 -0.101622 0.267495 0.278363 0.247654 0.241853 0.284098 0.262664
chargesum: 0.00000
title: Mulliken charges with hydrogens summed into heavy atoms:
elementType: Br O O N C C C C C C C C C
charge: 0.030298 -0.259387 -0.255294 -0.012006 0.201275 0.188765 0.616770 -0.218929 -0.000995 -0.398651 0.286819 -0.077042 -0.101622
polarizability: 1.75291893e+02 1.48534127e+00 1.15173569e+02 -3.17313492e-02 -5.09500865e+00 6.99878780e+01
1716.lowfreq: -0.0002 0.0002 0.0005 5.4067 7.1309 9.1394 27.0240 67.9583 83.4956
frequency: 26.8757 67.9547 83.4914 110.3144 175.5648 189.6962 241.0010 261.2460 303.7525 342.5262 357.2721 388.5603 425.2277 474.3608 554.8738 633.8281 667.5183 679.0517 707.7426 756.4304 793.1869 834.0208 857.2637 873.4486 910.6375 920.5558 949.2887 975.2743 1069.4916 1073.8062 1126.1508 1153.9399 1181.7137 1238.7051 1254.5639 1300.1748 1359.3839 1383.6273 1411.7247 1445.6587 1465.1039 1485.1038 1606.6809 1623.0215 2200.3507 3004.2069 3012.0197 3060.1271 3118.3619 3171.1890 3195.7766
redmass: 10.4613 6.5199 3.2051 5.8882 8.5929 8.5297 7.2555 6.4456 5.4984 9.6113 2.8250 7.3234 3.3081 4.5843 6.6619 8.3678 9.1243 9.5083 4.5901 5.2985 5.6342 8.5817 1.4655 1.5949 3.6240 2.1074 4.4334 4.7063 1.5349 3.7002 1.0605 1.8179 1.2317 1.3692 4.1600 1.4505 1.3917 3.3943 7.0150 1.1184 2.4243 1.2910 8.5677 9.1729 12.4327 1.0592 1.0596 1.1004 1.1123 1.0933 1.0938
irintensity: 3.1837 4.3993 9.0108 5.6913 1.1323 1.0288 5.0636 0.4202 2.6372 0.9583 0.6603 2.8985 12.2762 5.3574 12.9672 13.4918 4.4360 0.8456 1.7114 1.7641 15.2637 35.0492 6.6622 45.7314 13.9214 0.1833 48.8672 110.4195 6.6195 50.4899 1.2267 27.9822 3.0953 32.0322 138.3652 1.2821 2.5819 45.1923 2.0196 46.8977 198.2875 35.2354 3.1727 2.8989 7.6472 8.4840 108.2141 0.6818 24.7247 1.0639 0.9427
temp: 298.150 k
press: 1.00000 atm
elementType: 35 8 8 7 6 6 6 6 6 6 6 6 6 1 1 1 1 1 1
symmnumber: 1
zpe: 337956.1 jmol-1
zpe.correction: 0.128721 hartree
zpe.thermalcorrener: 0.140293 hartree
zpe.thermalcorrenthalpy: 0.141237 hartree
zpe.thermalcorrgfe: 0.088814 hartree
zpe.sumelectzpe: -564.247716 hartree
zpe.sumelectthermal: -564.236144 hartree
zpe.sumelectthermalent: -564.235200 hartree
zpe.sumelectthermalfe: -564.287623 hartree
dipole: 3.8544 -0.9495 -2.5497
dipole: 4.7179
quadrupole: -78.2742 -89.3360 -86.4396
quadrupole: 5.8523 10.6436 -9.0890
quadrupole: 6.4091 -4.6528 -1.7563 5.8523 10.6436 -9.0890
hfenergy: -564.376437 hartree
pointgroup: C01 [X(C9H6Br1N1O2)]
dipole: 1.5679202 -0.1012309 0.9883087 debye
dipolederiv: -0.3135879 0.2777257 -0.0115626 0.2913541 -0.363449 0.0295773 -0.0092514 0.0373849 -0.0194583 -1.3346316 0.3554319 0.132789 0.4177971 -0.550361 0.0115158 0.0793876 0.034346 -0.2929715 -1.439106 0.2307621 0.1631691 0.1454128 -0.4603102 0.0027447 0.1715411 -0.0024096 -0.2853611 -0.2735102 -0.028281 0.0079256 -0.0419387 -0.2401987 -0.0017288 -0.1078543 -0.0517353 -0.201873 0.7342533 -0.4007437 0.0038868 -0.9134355 0.3563709 0.0812335 0.165141 -0.0141931 0.0320202 1.1689691 -0.1151426 -0.1487097 0.3613737 -0.0556303 -0.0516029 -0.28013 0.0335347 0.0859576 -0.0130439 0.1816722 0.0011737 0.2212157 -0.156187 -0.0236919 -0.0205721 0.0202382 -0.0869866 -0.0701823 0.0362814 -0.0527688 -0.0261604 0.0016679 -0.0442202 -0.0169383 -0.0446111 -0.1339932 -0.2878162 0.0646764 0.0056519 0.2305469 -0.113186 -0.0366944 -0.0280726 -0.0004404 -0.0762498 0.4510934 -0.4939015 0.0082348 -0.5624542 0.6201427 -0.0681924 0.0438927 -0.1332157 -0.1346943 1.1302102 -0.1957134 -0.1372646 -0.2109414 0.6038592 0.0555346 -0.1880627 0.0737088 0.6119381 0.1785858 0.0371938 -0.0600008 0.0097277 0.2027692 -0.0269362 -0.0602444 -0.0511287 0.1184379 -0.0574897 0.0133576 0.1119901 0.0145623 -0.0104973 0.0463831 0.1885924 0.0942762 0.0519547 0.089668 -0.0152762 0.0329084 -0.0135358 -0.011534 0.0484099 0.0236257 0.0498534 0.1493316 0.0989203 -0.0201289 0.0168333 -0.0230957 0.0339551 0.0407677 0.0255977 0.0447219 0.1632708 -0.1240517 0.0367609 -0.044061 0.020172 0.0721949 -0.0091237 -0.0994876 0.0042293 0.0185702 -0.0145853 0.0238471 0.0196642 0.0691889 0.0179493 -0.0622653 0.1585413 -0.0968741 -0.1242352 0.0104142 0.008719 0.0042835 0.0544779 0.0639299 -0.086673 -0.022122 -0.0361742 0.0853597 0.0658905 0.0027594 -0.0541427 -0.0442674 -0.0114857 0.0949622 -0.0235843 0.038489 0.0389821 unknown
polarizability: 167.8245441|-19.9877927|122.0693397|-2.0255066|-6.8908401|70.5594562 unknown
InChI: InChI=1S/C9H6BrNO2/c10-7-4-9-8(12-5-13-9)3-6(7)1-2-11/h3-4H,1,5H2
charge 0 multiplicity 1
19 atoms
Br -1.975223 2.628493 -0.017798
O  2.520789 -1.526012 0.299767
O  3.065769 0.698977 -0.417998
N  -3.845242 -1.207189 -1.185068
C  1.360278 -0.718487 0.26803
C  1.682187 0.589637 -0.153662
C  -0.957718 -0.077741 0.551287
C  0.062232 -1.074591 0.626831
C  0.718029 1.594099 -0.236099
C  -0.606909 1.226729 0.122198
C  3.589347 -0.693016 -0.317823
C  -2.38733 -0.464974 0.927269
C  -3.197165 -0.870944 -0.241724
H  -0.17652 -2.090674 0.952195
H  0.967848 2.60627 -0.558508
H  4.471906 -0.696359 0.339164
H  3.798851 -1.071472 -1.335136
H  -2.902753 0.37669 1.425178
H  -2.372774 -1.307039 1.643297
