program: Gaussian 09
title: 000225772
version: EM64L-G09RevD.01
frameworkgroup: C1[X(C8H9NO4S)]
method: RPBEPBE
basis: SDD
operation: Freq
keyword: #p
keyword: freq=noraman
keyword: PBEPBE/SDD
title: #p freq=noraman PBEPBE/SDD
converged: YES YES NO NO
title: Mulliken charges:
elementType: S O O O O N C C C C C C C C H H H H H H H H H
charge: 0.975891 -0.540316 -0.513140 -0.438169 -0.247266 -0.561728 0.396562 -0.427068 -0.360439 0.273034 -0.725156 -0.180770 -0.337210 0.123917 0.297990 0.274800 0.237068 0.286705 0.280265 0.279725 0.280101 0.237739 0.387466
chargesum: 0.00000
title: Mulliken charges with hydrogens summed into heavy atoms:
elementType: S O O O O N C C C C C C C C
charge: 0.975891 -0.540316 -0.513140 -0.050703 -0.247266 -0.263738 0.396562 -0.152268 -0.123370 0.273034 0.121539 0.056969 -0.057110 0.123917
polarizability: 2.16217890e+02 -9.84619901e+00 1.48901511e+02 -8.71603112e+00 3.52490911e+00 8.02385705e+01
1716.lowfreq: -9.0375 -6.7321 -0.0004 0.0015 0.0017 3.4479 23.7884 37.9318 50.8500
frequency: 22.5749 37.7972 50.8404 73.6655 142.7052 151.7730 159.3880 172.5407 178.8640 207.4980 248.7413 300.2059 327.1457 360.2504 373.2413 410.0829 421.0494 493.9413 523.7688 553.6541 588.3116 593.6799 614.2490 682.6296 714.4404 731.0635 808.7987 814.0909 849.3003 896.4905 910.6261 928.3780 938.2921 982.5698 987.0744 995.4316 1026.7133 1044.7942 1093.7211 1129.0356 1183.0743 1221.3350 1231.4036 1304.8855 1315.3785 1324.2567 1399.6911 1413.6255 1415.2060 1451.3777 1466.5530 1577.2133 1609.8564 1645.8434 3037.5103 3128.5190 3156.4587 3168.5548 3185.7968 3186.1874 3194.3442 3338.9002 3533.5284
redmass: 6.2287 5.8076 8.3403 7.9264 2.3599 4.4894 1.6284 4.5999 6.0835 4.5470 4.0354 6.2686 7.5611 7.1207 7.8727 4.8236 3.1011 4.6244 3.3721 5.0037 4.8237 4.6934 1.6264 2.1227 5.0133 4.8326 8.6542 1.5781 1.7056 4.3680 2.3844 1.4324 1.5656 1.4751 3.7962 1.3737 1.9164 2.5191 1.7098 1.5548 1.1025 1.9369 1.5897 1.3721 1.1618 2.5514 7.3724 1.0526 1.0545 2.7221 2.5605 6.3482 6.1675 8.8603 1.0248 1.0890 1.0933 1.0925 1.0964 1.1075 1.1076 1.0744 1.0642
irintensity: 6.6137 1.8276 1.7666 0.3178 3.6483 4.6354 1.9910 0.7368 10.1037 2.4359 2.3755 7.3151 54.0404 3.7720 26.0868 28.3195 8.4404 21.8111 8.9894 22.8193 31.7083 59.7473 132.5950 5.4652 17.8200 46.3121 67.0051 17.2255 165.8772 9.7262 38.6237 0.6912 4.8937 26.8441 11.4498 0.7177 96.0470 173.9013 12.0308 118.5622 1.5696 14.3124 1.6910 31.2826 13.0852 100.1514 0.9548 10.6670 13.2025 29.5569 3.7926 23.0252 10.5260 213.3988 0.1308 5.1874 14.1565 2.0939 3.2059 0.2773 0.1933 12.4453 51.8515
temp: 298.150 k
press: 1.00000 atm
elementType: 16 8 8 8 8 7 6 6 6 6 6 6 6 6 1 1 1 1 1 1 1 1 1
symmnumber: 1
zpe: 424847.3 jmol-1
zpe.correction: 0.161816 hartree
zpe.thermalcorrener: 0.176465 hartree
zpe.thermalcorrenthalpy: 0.177410 hartree
zpe.thermalcorrgfe: 0.118357 hartree
zpe.sumelectzpe: -1062.758820 hartree
zpe.sumelectthermal: -1062.744170 hartree
zpe.sumelectthermalent: -1062.743226 hartree
zpe.sumelectthermalfe: -1062.802279 hartree
dipole: -1.5265 0.8781 -2.8388
dipole: 3.3407
quadrupole: -83.1856 -80.3236 -95.9034
quadrupole: -9.3747 -12.4562 0.6348
quadrupole: 3.2852 6.1473 -9.4325 -9.3747 -12.4562 0.6348
hfenergy: -1062.9206356 hartree
pointgroup: C01 [X(C8H9N1O4S1)]
dipole: 0.50369 -0.8925884 -0.8228101 debye
dipolederiv: 1.4463519 -0.1070637 -0.0252946 -0.4713381 1.317783 0.0517346 0.173349 -0.0702509 1.1977049 -1.0624973 0.1294562 0.1208757 0.0079075 -0.5169902 0.0751306 0.1874996 -0.035039 -0.5528373 -0.4617555 -0.0694127 -0.0852428 0.2924687 -0.6825723 -0.1047061 0.0564844 -0.0530321 -0.4988059 -1.4425631 -0.1082205 -0.0960826 -0.1226605 -0.3368296 -0.0684961 -0.155237 -0.0973835 -0.3889208 -0.6589981 -0.075746 -0.0037937 -0.1253082 -0.7197889 0.3914093 0.0156954 0.3348668 -0.6620044 -0.2305582 -0.1025572 -0.100645 0.0085991 -0.3194917 -0.1211804 -0.5718969 0.0065802 -0.3598172 0.5230657 -0.0425062 0.08712 0.0663588 -0.1367206 0.03246 0.0911369 0.0168837 -0.0265877 0.0363304 0.0916112 -0.0695019 -0.1089596 -0.0137404 -0.0697854 -0.0199109 0.0334033 -0.041007 -0.0311578 0.079473 -0.0140319 0.0797047 -0.0093791 -0.060609 0.1354872 -0.1155151 -0.059872 -0.3010747 -0.1721815 0.1357352 -0.2458952 -0.2403147 0.1768876 0.0994107 0.1953901 -0.090762 -0.1250661 -0.0154917 -0.0094677 0.0675169 -0.0845375 0.0214548 0.0121499 0.0318356 -0.1606608 -0.2328304 -0.0684809 0.0838107 -0.2041054 0.0354494 -0.1229533 0.1216765 -0.1321967 -0.0018779 -0.050718 0.0153249 0.0571309 0.1774809 -0.0188008 -0.0533853 -0.1115753 -0.0816242 -0.0623194 1.832416 0.3757781 -0.00653 0.5506791 0.9491149 -0.6179425 -0.0562298 -0.5278944 0.7665315 0.0783953 0.0771324 0.0434822 0.0029126 0.111231 0.0706308 0.1735952 0.0875681 0.1602905 0.0976555 0.0296885 -0.0491654 0.060974 0.074083 0.0470829 -0.0455408 0.0378772 0.0787127 0.0058772 -0.1038783 0.0454187 -0.0629269 0.0552541 0.0692992 0.0367118 0.0533718 0.0952804 0.0544606 0.0671525 0.0044483 0.0748367 0.0406602 -0.0113562 -0.0428444 -0.0000294 0.0546056 -0.0106332 -0.0160715 0.0254179 -0.0232142 0.099406 0.0340932 0.0132872 0.0412356 0.0356212 0.085758 -0.0355377 -0.0440246 -0.0238273 0.0123759 -0.0073272 -0.0519778 -0.0054227 0.0406009 0.0081948 0.0022936 -0.0358336 0.009346 0.1360443 0.0180353 -0.0300498 0.0134105 0.1424976 0.0473063 0.0462489 -0.0503307 0.0353749 0.0197583 0.1153595 -0.0725691 0.1193625 0.0531843 0.3920408 0.0029886 -0.013495 -0.0459245 0.2280058 0.1341634 0.0413479 0.1466026 0.2804426 unknown
polarizability: 217.4753897|-8.0895596|126.2934707|-0.6154314|-31.8839697|101.5891117 unknown
InChI: InChI=1S/C8H9NO4S/c1-14(12,13)9-7-4-2-3-6(5-7)8(10)11/h2-5,9-10H,1H3
charge 0 multiplicity 1
23 atoms
S  -2.9240 0.190552 0.365852
O  -4.170103 -0.469944 1.184667
O  -1.941499 1.29734 1.039509
O  3.953807 0.618855 -0.569136
O  2.212563 1.536083 -1.801553
N  -1.841589 -1.337434 -0.369009
C  -0.467733 -1.31082 -0.000146
C  0.385399 -0.353066 -0.604832
C  0.081021 -2.248018 0.923534
C  1.764613 -0.340455 -0.300024
C  -3.587887 0.896144 -1.268964
C  1.463359 -2.248094 1.200559
C  2.311256 -1.291952 0.601265
C  2.610345 0.687346 -0.968304
H  -2.349891 -2.134519 0.066814
H  -0.008536 0.37488 -1.320475
H  -0.578863 -2.975284 1.412981
H  -4.249594 1.727114 -0.987284
H  -2.711472 1.228774 -1.839939
H  -4.122625 0.074862 -1.763037
H  3.38169 -1.269022 0.820662
H  1.876397 -2.983348 1.898601
H  4.465442 1.328605 -1.042141
