program: Gaussian 09
title: 000225738
version: EM64L-G09RevD.01
frameworkgroup: C1[X(C14H10N2O2)]
method: RPBEPBE
basis: SDD
operation: Freq
keyword: #p
keyword: freq=noraman
keyword: PBEPBE/SDD
title: #p freq=noraman PBEPBE/SDD
converged: YES YES NO NO
title: Mulliken charges:
elementType: O O N N C C C C C C C C C C C C C C H H H H H H H H H H
charge: -0.262304 -0.276267 -0.191848 -0.386883 0.123356 0.151545 0.111629 0.443413 0.139875 -0.315311 -0.332327 -0.339314 -0.409256 -0.222325 -0.215418 -0.214909 -0.202639 -0.243473 0.349621 0.279723 0.277861 0.289136 0.264125 0.239155 0.239454 0.233706 0.234096 0.235579
chargesum: 0.00000
title: Mulliken charges with hydrogens summed into heavy atoms:
elementType: O O N N C C C C C C C C C C C C C C
charge: -0.262304 -0.276267 -0.191848 -0.037262 0.123356 0.151545 0.111629 0.443413 0.139875 -0.035588 -0.054466 -0.050178 -0.145132 0.016829 0.024037 0.018797 0.031457 -0.007894
polarizability: 2.85105203e+02 1.72585837e+00 1.76523458e+02 -1.66053992e+00 8.05883096e+00 7.65061111e+01
1716.lowfreq: -6.6214 0.0006 0.0007 0.0008 3.8405 5.3479 37.1206 49.9107 92.8579
frequency: 37.1166 49.9049 92.8574 106.6124 128.1417 191.1214 229.7368 252.5032 265.2581 286.7737 365.3486 382.6150 403.1839 416.5215 442.1978 461.4289 482.3382 508.7429 552.2165 575.1273 613.0395 647.2374 649.2122 668.5628 684.5142 695.2974 716.0288 762.7443 779.7582 797.9774 822.1961 838.5084 843.2648 917.2090 918.2802 972.1431 986.2978 994.7263 996.3290 1012.7351 1015.4088 1029.1754 1052.5898 1079.7688 1091.8012 1134.1736 1172.3760 1176.2689 1193.7730 1206.0932 1225.4268 1267.2128 1277.0768 1324.3495 1335.6457 1382.2197 1398.6734 1430.9348 1444.6983 1454.6595 1466.4986 1481.2457 1562.3429 1582.2379 1592.9506 1606.6505 1616.6009 1626.8310 3133.2375 3138.5606 3142.0376 3153.5247 3153.8469 3166.6913 3170.0761 3175.0992 3204.9142 3525.1243
redmass: 6.1406 4.1276 5.9289 6.7925 5.1572 5.5000 5.5499 7.2381 6.2599 6.4853 10.3999 6.6103 2.8487 3.0735 4.0828 8.1058 10.4582 3.4023 2.3552 2.1886 6.1816 4.9797 5.4202 6.2339 3.9660 2.1074 5.4870 1.7318 4.9051 1.4324 5.3699 1.9247 2.2935 1.4027 1.4025 1.3740 5.2403 1.3568 1.3764 3.5535 1.4202 2.1750 2.4051 2.7258 1.7494 2.1093 1.0898 1.0519 1.1681 3.4815 2.5663 2.4264 2.4816 1.8975 2.0307 7.1276 10.7507 1.9136 2.3753 2.6577 2.6316 2.2662 8.4055 7.4366 6.5810 6.0471 6.7601 6.7517 1.0855 1.0865 1.0891 1.0904 1.0945 1.0948 1.1002 1.1000 1.0953 1.0788
irintensity: 2.0422 0.8360 1.8377 5.0768 0.0413 0.4995 0.7130 3.5011 0.3248 2.2012 21.6575 2.2126 4.4833 10.9028 3.5772 1.2136 1.3953 26.9560 24.1068 46.9002 3.6710 3.8293 2.4292 7.5262 73.6445 30.0669 7.1260 81.7513 0.1406 50.2045 11.8660 0.4494 2.4942 3.6525 0.2723 1.0009 1.0972 0.3417 3.7572 24.4541 1.7024 19.3417 26.8431 6.4447 2.8797 28.9688 10.9457 0.4247 1.2260 25.9336 32.4113 146.5499 102.9871 54.3464 45.4709 10.9856 30.0457 11.9867 12.2438 0.9744 4.5440 94.3012 59.8317 241.0452 77.6922 55.7227 9.3089 119.2772 3.0351 3.9851 4.9331 7.7600 21.6246 1.5803 24.4025 23.7699 1.0956 60.6466
temp: 298.150 k
press: 1.00000 atm
elementType: 8 8 7 7 6 6 6 6 6 6 6 6 6 6 6 6 6 6 1 1 1 1 1 1 1 1 1 1
symmnumber: 1
zpe: 548706.7 jmol-1
zpe.correction: 0.208991 hartree
zpe.thermalcorrener: 0.222771 hartree
zpe.thermalcorrenthalpy: 0.223715 hartree
zpe.thermalcorrgfe: 0.167809 hartree
zpe.sumelectzpe: -798.212410 hartree
zpe.sumelectthermal: -798.198630 hartree
zpe.sumelectthermalent: -798.197686 hartree
zpe.sumelectthermalfe: -798.253592 hartree
dipole: 0.8862 -0.5395 0.0828
dipole: 1.0408
quadrupole: -75.5002 -113.2691 -105.7144
quadrupole: 10.9033 -2.1171 4.9358
quadrupole: 22.6611 -15.1079 -7.5531 10.9033 -2.1171 4.9358
hfenergy: -798.4214013 hartree
pointgroup: C01 [X(C14H10N2O2)]
dipole: -0.3477399 -0.2139942 -0.0312148 debye
polarizability: 285.1055339|-1.2214344|176.4986227|-2.3556648|-8.1273681|76.5306161 unknown
InChI: InChI=1S/C14H10N2O2/c17-13-11-8-4-5-9-12(11)14(18)16(15-13)10-6-2-1-3-7-10/h1-9,15H
charge 0 multiplicity 1
28 atoms
O  -0.184843 -2.232515 -0.024342
O  1.560829 2.970029 0.442792
N  -0.618676 0.056925 0.195288
N  -0.101605 1.378067 0.319523
C  1.708604 -0.710141 0.006214
C  2.187735 0.628329 0.078666
C  0.257415 -1.046519 0.067382
C  -2.054901 -0.02713 0.083202
C  1.241336 1.751634 0.282442
C  2.632447 -1.773931 -0.155088
C  3.575353 0.896298 -0.006124
C  -2.761363 -1.113409 0.658771
C  -2.759389 1.005728 -0.590449
C  4.010862 -1.502739 -0.242755
C  4.484507 -0.166034 -0.168439
C  -4.167748 -1.152904 0.558551
C  -4.167419 0.956966 -0.670617
C  -4.878905 -0.120692 -0.096669
H  -0.787354 2.085149 0.598839
H  2.239627 -2.793733 -0.212671
H  3.906437 1.937345 0.062685
H  -2.214073 -1.915376 1.155578
H  -2.215524 1.818756 -1.083949
H  4.721678 -2.326407 -0.368456
H  5.558546 0.037023 -0.236473
H  -4.70938 -1.995079 1.002233
H  -4.703591 1.75472 -1.195675
H  -5.971205 -0.15846 -0.163558
