program: Gaussian 09
title: 000225732
version: EM64L-G09RevD.01
frameworkgroup: C1[X(C8H6N2O)]
method: RPBEPBE
basis: SDD
operation: Freq
keyword: #pfreq=noraman
keyword: PBEPBE/SDD
title: #p freq=noraman PBEPBE/SDD
converged: NO NO NO NO
title: Mulliken charges:
elementType: O N N C C C C C C C C H H H H H H
charge: -0.230222 -0.053748 -0.552694 0.253369 0.031785 0.064074 -0.328401 -0.311139 -0.091059 -0.263002 -0.177849 0.231561 0.263934 0.233695 0.231493 0.335232 0.362969
chargesum: 0.00000
title: Mulliken charges with hydrogens summed into heavy atoms:
elementType: O N N C C C C C C C C
charge: -0.230222 -0.053748 0.145507 0.253369 0.031785 0.064074 -0.096839 -0.047205 -0.091059 -0.029307 0.053644
polarizability: 1.75781140e+02 3.21961987e+00 1.15260624e+02 -7.81535944e-03 -3.41618592e-03 3.99324662e+01
1716.lowfreq: -0.0006 -0.0002 0.0007 1.7254 8.2606 14.1643 126.7311 138.3829 229.7640
frequency: 126.7281 138.3789 229.7636 261.7723 296.6462 352.7797 433.2728 472.8679 513.3746 525.8262 604.1748 643.0999 644.7590 697.6341 724.6816 753.1476 775.6429 781.3363 806.8710 864.1104 867.2765 949.7656 991.2283 991.6224 1090.7084 1099.1392 1146.1571 1173.9124 1213.0438 1259.8965 1313.9193 1358.0693 1416.3409 1463.2695 1513.1857 1554.5726 1619.2450 1629.0480 1683.4538 3115.3200 3131.4946 3163.2129 3175.2445 3409.5567 3592.7664
redmass: 5.5352 4.9539 3.1585 6.6169 7.1561 3.5790 2.3030 9.1707 2.7227 5.9357 5.6335 8.2615 1.4955 6.7241 3.1968 1.5755 1.3153 4.0587 3.3165 6.7290 1.5372 1.3575 2.2600 1.3526 3.6896 4.1302 1.4565 1.4861 1.5931 3.8978 1.9114 2.9189 2.9889 3.0823 4.7935 2.4677 2.6228 4.3372 6.6828 1.0891 1.0888 1.0951 1.0973 1.0494 1.0980
irintensity: 4.5432 4.5696 5.0549 0.0337 5.2626 3.1055 0.7383 17.3992 12.1001 9.2489 0.5945 6.2919 79.7122 18.5074 44.9742 18.0112 194.5823 14.3151 1.2478 1.5436 5.9842 0.5676 5.0978 1.4276 24.3500 49.1942 67.2698 6.3367 7.8055 164.1619 30.9179 10.7131 238.5736 4.3871 109.4619 221.8130 66.5176 212.1586 500.0649 7.4873 12.9371 20.4717 13.3533 115.5225 47.3508
temp: 298.150 k
press: 1.00000 atm
elementType: 8 7 7 6 6 6 6 6 6 6 6 1 1 1 1 1 1
symmnumber: 1
zpe: 326391.0 jmol-1
zpe.correction: 0.124316 hartree
zpe.thermalcorrener: 0.132609 hartree
zpe.thermalcorrenthalpy: 0.133553 hartree
zpe.thermalcorrgfe: 0.091223 hartree
zpe.sumelectzpe: -492.393517 hartree
zpe.sumelectthermal: -492.385224 hartree
zpe.sumelectthermalent: -492.384280 hartree
zpe.sumelectthermalfe: -492.426610 hartree
dipole: -2.7051 7.0479 -0.0004
dipole: 7.5492
quadrupole: -60.2190 -56.8377 -66.2601
quadrupole: 15.1977 -0.0020 -0.0012
quadrupole: 0.8866 4.2679 -5.1545 15.1977 -0.0020 -0.0012
hfenergy: -492.5178327 hartree
pointgroup: C01[X(C8H6N2O1)]
dipole: 1.1650701 2.7320271 0.0001561 debye
dipolederiv: -1.3466303 -0.2617945 0.0000644 0.0486912 -0.3449737 0.0000018 -0.0000794 0.0000081 -0.3434071 -1.6829637 -0.6190672 0.0000398 0.2099681 -0.2962725 0.0000155 0.0000919 0.0000391 -0.3084133 -0.6732594 0.5774229 0.0000203 0.7049912 -0.9188214 -0.0000696 0.0000425 -0.0000638 -0.5061442 -0.9052029 0.8918107 0.000087 -0.2556255 -0.4406024 0.0000059 0.0000517 -0.0000986 -0.0895545 1.4346975 0.8299547 -0.0000608 0.2500092 0.5573621 -0.000011 -0.000046 -0.0000301 0.0879497 1.2034356 -1.1454945 -0.0001241 -0.6844758 0.4834235 0.0000365 -0.0001495 0.0001079 0.2124249 0.5530047 -0.5082305 -0.0000596 0.2118436 0.0392256 -0.0000024 -0.0000405 0.0000536 -0.0816028 -0.8739085 -0.5835559 0.0000192 -0.0660818 0.0826986 0.0000125 0.0000498 0.00006 -0.1918904 1.69994 0.2092968 -0.0000499 -0.5887749 0.3522153 0.0000349 0.0000477 -0.0000141 0.1580183 -0.2144316 0.4826656 0.0000196 0.2464198 -0.5740339 -0.0000268 0.0000133 -0.0000394 -0.221213 0.3460506 0.1479904 -0.0000185 0.0976614 0.7215995 0.0000257 -0.0000254 0.0000237 -0.0761469 0.0754759 0.0408957 0.0000076 -0.0237308 -0.1103116 -0.0000102 0.0000031 -0.000013 0.1525741 0.0758164 -0.0039192 0.0000038 0.0470585 -0.0485188 -0.0000111 0.0000034 -0.0000072 0.1705597 -0.0592747 -0.088735 0.0000105 -0.1019209 0.0118019 -0.0000012 0.0000089 -0.0000064 0.1779083 -0.0878855 0.0885965 0.000017 0.0791511 0.069861 -0.0000075 0.0000177 -0.0000151 0.1454587 0.1591897 -0.001719 0.0000189 -0.0970271 0.2299301 0.0000044 0.0000237 -0.0000111 0.3743624 0.2959461 -0.0561174 0.0000047 -0.0781574 0.1854168 0.0000025 -0.0000128 0.0000066 0.339116 unknown
polarizability: 175.464387|-5.4254664|115.577377|-0.007685|0.0037001|39.9324662 unknown
InChI: InChI=1S/C8H6N2O/c9-7-5-3-1-2-4-6(5)10-8(7)11/h1-4H,9H2
charge 0 multiplicity 1
17 atoms
O  -3.103756 -0.685585 0.000125
N  -0.846661 -1.553558 0.00011
N  -1.981442 1.911118 0.000308
C  0.222454 0.630669 0.000124
C  0.344132 -0.845153 0.000036
C  -1.165012 0.849491 0.00022
C  1.373277 1.480165 0.000082
C  1.65587 -1.407715 -0.000059
C  -1.837877 -0.592083 0.000264
C  2.639179 0.889462 -0.000025
C  2.763749 -0.547819 -0.000093
H  1.273257 2.573113 0.000135
H  1.772825 -2.495101 -0.000104
H  3.542641 1.507384 -0.000053
H  3.771045 -0.982189 -0.000171
H  -1.666407 2.882312 0.000312
H  -2.989675 1.70249 0.00039
