program: Gaussian 09
title: 000225755
version: EM64L-G09RevD.01
frameworkgroup: C1[X(C21H28O5)]
method: RPBEPBE
basis: SDD
operation: Freq
keyword: #pfreq=noraman
keyword: PBEPBE/SDD
title: #p freq=noraman PBEPBE/SDD
converged: NO YES NO NO
title: Mulliken charges:
elementType: O O O O O C C C C C C C C C C C C C C C C C C C C C H H H H H H H H H H H H H H H H H H H H H H H H H H H H
charge: -0.455663 -0.461658 -0.173621 -0.236153 -0.173320 0.354544 -0.085462 -0.183549 -0.145069 0.179292 0.242634 -0.626683 -0.152073 -0.564757 -0.539427 -0.471948 -0.849567 0.533494 -0.637537 -0.498852 -0.794726 0.050130 -0.572323 -0.590763 0.178912 -0.080993 0.172190 0.260678 0.208627 0.217914 0.273473 0.225705 0.227897 0.241209 0.269300 0.241585 0.226976 0.209282 0.239059 0.220041 0.276189 0.228818 0.234069 0.210479 0.235884 0.210052 0.281078 0.217012 0.342256 0.244543 0.233435 0.346883 0.254341 0.206165
chargesum: 0.00000
title: Mulliken charges with hydrogens summed into heavy atoms:
elementType: O O O O O C C C C C C C C C C C C C C C C C C C C C
charge: -0.113407 -0.114775 -0.173621 -0.236153 -0.173320 0.354544 0.086727 0.077129 0.063557 0.179292 0.242634 -0.135296 0.073632 -0.095651 -0.028543 -0.035690 -0.114277 0.533494 -0.174650 -0.052489 -0.086584 0.050130 -0.094344 -0.336422 0.178912 0.125172
polarizability: 3.02355959e+02 -7.55482986e+00 2.15814316e+02 -1.94222382e+01 4.55716870e+00 1.81411560e+02
1716.lowfreq: -7.3802 -0.0003 0.0004 0.0006 8.6506 11.1687 29.1717 35.0209 54.8771
frequency: 29.0004 34.8688 54.8390 66.0939 83.7235 89.3301 106.8726 124.7098 140.1784 151.3830 163.1732 170.6055 185.7612 197.6401 200.2721 218.2034 225.6703 245.2469 250.2506 258.9874 274.2275 279.5857 301.2951 307.7590 317.8962 322.6225 351.5232 361.1013 372.8811 382.9681 401.8359 416.7620 427.8920 453.5066 472.6059 494.3443 508.8984 522.4064 529.3725 531.6363 552.4042 573.7802 622.7800 633.4587 649.0104 688.5829 724.1288 738.6851 753.0899 775.9166 794.4370 798.0066 813.7202 844.7613 847.2421 878.2354 885.0968 899.8971 907.4379 914.7462 928.4348 933.3561 949.7603 959.9601 969.3580 985.3021 988.7893 1017.2860 1024.8854 1031.7034 1034.7011 1052.9113 1053.6274 1072.2198 1084.9885 1101.8591 1111.7707 1115.8801 1122.5903 1127.7533 1132.6885 1150.8930 1158.4222 1175.8287 1184.7399 1188.0159 1199.1117 1209.2072 1220.3094 1228.0350 1242.7493 1252.9456 1271.7699 1274.5326 1279.2023 1283.1953 1292.4421 1298.2491 1310.1781 1318.4162 1323.9078 1327.2623 1329.5119 1341.9227 1344.9225 1347.8954 1352.3464 1353.3207 1360.5906 1374.4714 1386.3673 1395.6625 1401.1134 1442.9576 1456.6617 1459.1888 1463.0289 1468.4848 1469.0972 1470.0276 1473.1747 1488.4255 1495.0474 1495.3504 1586.0270 1600.6383 1616.2450 1627.1717 2856.2033 2908.7417 2921.1961 2954.5496 2958.0774 2963.8473 2969.3237 2983.5743 2987.8358 2989.9455 2991.1062 2998.4815 3004.9035 3017.0739 3035.4493 3040.2086 3040.8604 3043.1913 3060.4510 3063.8597 3071.6581 3074.6211 3082.4095 3115.5100 3116.7328 3121.7809 3554.5392 3569.3960
redmass: 7.0813 5.7624 5.0172 4.6720 4.0525 4.7049 2.7696 2.6567 1.9891 2.6012 2.8205 2.0050 3.7130 2.9433 2.7409 2.8289 2.7387 2.2167 1.7063 2.0059 3.4297 3.0230 2.6838 1.5139 2.7131 2.3109 4.4150 2.5463 2.9394 3.1065 3.4635 3.0877 3.4761 2.7466 3.8765 3.8540 3.5791 3.9301 2.6377 3.0419 4.4276 3.2386 3.9750 3.5876 3.6997 3.3580 5.0721 3.7160 3.6460 2.2366 2.1727 2.1190 2.3004 2.6848 2.5509 2.1695 1.7185 2.3676 1.9332 2.1502 1.8174 1.9561 1.9709 2.1426 2.5881 3.0638 2.3075 2.2169 2.0507 2.0117 2.1229 3.2773 2.1757 2.3039 2.4383 1.6802 2.0207 1.8442 2.3382 2.2467 1.8661 1.7727 2.3342 1.6429 1.4628 1.8381 2.0237 1.4630 1.6761 1.3421 1.6928 1.4232 1.5635 1.3735 1.9290 1.3271 1.4393 1.4312 1.4902 1.4405 1.3718 1.8571 1.5964 1.4844 1.8842 1.3948 1.2439 1.3474 1.3660 1.3883 1.4342 1.2587 1.1901 1.0782 1.0773 1.0831 1.0753 1.0838 1.0895 1.0718 1.0615 1.0770 1.0605 1.0550 9.9504 10.4015 10.2013 7.8434 1.0797 1.0801 1.0869 1.0812 1.0667 1.0619 1.0649 1.0628 1.0551 1.0475 1.0391 1.0819 1.0602 1.0631 1.0949 1.0991 1.0986 1.0978 1.1015 1.0962 1.0967 1.0978 1.1028 1.0975 1.0912 1.0978 1.0658 1.0660
irintensity: 2.1814 3.4677 2.6328 3.2833 8.9624 2.5543 3.1327 68.2627 48.0979 51.8582 3.4452 5.9762 14.5154 0.1462 3.4702 0.2480 3.2917 4.4471 6.5778 7.4632 8.1172 5.2537 8.0914 71.3451 15.1713 39.7453 0.6984 3.3408 1.8773 2.0996 10.1417 3.1934 3.7950 3.8436 10.1972 3.3497 4.8775 49.8069 4.0534 1.2883 9.1873 3.5455 2.8661 7.9833 0.0485 9.8257 13.9826 6.0664 0.1925 6.1041 6.1513 6.1472 7.6573 7.5852 7.2454 8.4267 16.4271 32.6318 16.6379 12.0520 2.8108 30.1984 13.9454 7.6484 7.8692 5.0212 13.1456 2.1332 9.2680 2.9500 0.7510 5.8944 8.4822 54.4777 4.5580 52.2192 10.9317 14.6723 8.3324 17.9652 13.3278 3.0598 3.0715 3.0306 8.8517 26.1682 21.1526 12.5024 2.5073 16.6897 21.2692 6.5487 10.4107 3.0515 24.4601 14.6658 9.8337 2.0750 27.2396 6.8192 0.7133 14.8086 10.2951 6.1300 4.2134 4.5270 0.6362 6.5804 2.3602 0.4077 1.8860 18.8336 31.8946 21.5157 9.9265 16.4376 14.8803 8.0440 7.8953 21.8636 6.3423 1.4171 10.5769 4.7606 179.4430 99.5906 88.1892 186.4247 33.5926 13.5836 118.4958 34.2551 19.3478 20.2538 35.5971 16.1622 34.0893 15.7433 26.2952 22.0555 22.8617 17.2355 48.9929 3.0002 31.1009 36.3072 14.7276 24.4464 23.0649 37.6896 20.4671 9.3778 10.8520 4.5997 4.9822 5.6065
temp: 298.150 k
press: 1.00000 atm
elementType: 8 8 8 8 8 6 6 6 6 6 6 6 6 6 6 6 6 6 6 6 6 6 6 6 6 6 1 1 1 1 1 1 1 1 1 1 1 1 1 1 1 1 1 1 1 1 1 1 1 1 1 1 1 1
symmnumber: 1
zpe: 1180760.6 jmol-1
zpe.correction: 0.449728 hartree
zpe.thermalcorrener: 0.475033 hartree
zpe.thermalcorrenthalpy: 0.475977 hartree
zpe.thermalcorrgfe: 0.396467 hartree
zpe.sumelectzpe: -1191.122616 hartree
zpe.sumelectthermal: -1191.097311 hartree
zpe.sumelectthermalent: -1191.096367 hartree
zpe.sumelectthermalfe: -1191.175878 hartree
dipole: -3.4548 2.3288 0.8574
dipole: 4.2537
quadrupole: -209.2287 -148.6363 -158.5711
quadrupole: -0.9170 16.8240 -4.3130
quadrupole: -37.0833 23.5090 13.5743 -0.9170 16.8240 -4.3130
hfenergy: -1191.5723444 hartree
pointgroup: C01 [X(C21H28O5)]
dipole: 1.3629038 -0.8734297 0.424644 debye
polarizability: 303.0036776|-5.6578541|214.1915594|17.9717763|-8.6924166|182.3865981 unknown
InChI: InChI=1S/C21H28O5/c1-19-7-5-13(23)9-12(19)3-4-14-15-6-8-21(26,17(25)11-22)20(15,2)10-16(24)18(14)19/h9,11,14-16,18,24,26H,3-8,10H2,1-2H3
charge 0 multiplicity 1
54 atoms
O  3.267933 -0.396921 -2.060242
O  -0.125587 2.06429 1.308656
O  5.375958 -0.115558 0.684381
O  -6.393468 0.28162 -1.41413
O  4.216623 2.472775 -1.152849
C  1.986786 0.01169 0.125351
C  1.057267 -1.230486 -0.056314
C  -0.34537 -1.059731 0.566151
C  -1.027615 0.197503 -0.05874
C  3.305142 -0.538635 -0.586564
C  -2.516318 0.431597 0.437811
C  1.31085 1.219048 -0.559659
C  -0.134731 1.470566 -0.052449
C  1.93782 -2.42927 0.364118
C  3.361876 -2.042061 -0.149299
C  -1.203879 -2.316418 0.27774
C  2.320409 0.2998 1.614361
C  -3.303031 -0.865376 0.174196
C  -2.683284 -2.147952 0.696775
C  -3.125829 1.610987 -0.381275
C  -2.626849 0.733837 1.968139
C  4.587927 0.217071 -0.23932
C  -4.667012 1.661462 -0.351066
C  -4.530679 -0.879525 -0.437963
C  -5.279595 0.338877 -0.807558
C  4.973526 1.484226 -1.023163
H  0.874586 -1.328763 -1.157148
H  -0.247756 -0.927578 1.66186
H  -1.131432 -0.038893 -1.145265
H  1.267915 1.042012 -1.652476
H  1.913025 2.139528 -0.434813
H  -0.592343 2.213235 -0.740244
H  1.589478 -3.381989 -0.070481
H  1.931216 -2.548923 1.463256
H  4.130612 -2.174641 0.631612
H  3.67488 -2.647107 -1.018883
H  -0.775113 -3.195874 0.794694
H  -1.160821 -2.529438 -0.811389
H  2.92283 -0.504044 2.071445
H  2.908261 1.23303 1.699323
H  1.402505 0.439854 2.204641
H  -2.735382 -2.134921 1.805918
H  -3.277731 -3.019058 0.3655
H  -2.805237 1.513879 -1.43942
H  -2.716208 2.564894 -0.001727
H  -2.164007 -0.058969 2.581213
H  -2.113152 1.676839 2.204191
H  -3.689092 0.80417 2.266349
H  2.489859 -0.896772 -2.413729
H  -5.059089 2.473934 -0.98787
H  -5.02834 1.861152 0.678436
H  0.568613 2.771186 1.326376
H  -5.045948 -1.830002 -0.630674
H  6.040997 1.50075 -1.350186
