program: Gaussian 09
title: 000225703
version: EM64L-G09RevD.01
frameworkgroup: C1[X(C13H14N4O)]
method: RPBEPBE
basis: SDD
operation: Freq
keyword: #p
keyword: freq=noraman
keyword: PBEPBE/SDD
title: #p freq=noraman PBEPBE/SDD
converged: YES YES NO NO
title: Mulliken charges:
elementType: O N N N N C C C C C C C C C C C C C H H H H H H H H H H H H H H
charge: -0.300804 -0.502379 -0.502376 -0.703293 -0.703287 0.482679 0.482784 -0.447048 -0.447071 -0.318320 -0.318415 0.262106 0.512205 0.512186 -0.405375 -0.405374 -0.419451 -0.419339 0.279975 0.279970 0.207291 0.207286 0.302587 0.302524 0.214085 0.214089 0.214230 0.214235 0.299443 0.302703 0.299449 0.302705
chargesum: 0.00000
title: Mulliken charges with hydrogens summed into heavy atoms:
elementType: O N N N N C C C C C C C C C C C C C
charge: -0.300804 -0.222403 -0.222406 -0.101147 -0.101134 0.482679 0.482784 -0.239757 -0.239784 -0.015733 -0.015891 0.262106 0.512205 0.512186 -0.191291 -0.191285 -0.205221 -0.205104
polarizability: 3.64232443e+02 1.18826651e-03 1.70762286e+02 6.23660834e-02 -3.28808836e-04 6.94757541e+01
1716.lowfreq: -0.0011 -0.0010 -0.0004 5.5139 9.3185 23.2476 28.6678 32.6064 62.0193
frequency: 28.6012 32.5319 62.0174 63.1185 68.4722 151.0784 154.1393 174.5892 205.0926 297.4492 297.7148 299.6501 326.0462 330.2717 338.5574 338.9138 359.4990 386.0225 406.5368 409.9383 410.4871 440.9533 456.8526 519.2559 520.8217 563.8836 593.2491 632.1578 639.5500 685.2003 715.4041 716.9936 738.6403 771.5010 798.7782 799.9191 808.5338 828.7538 834.8971 836.5774 878.5574 915.0673 915.5978 973.0714 974.7533 989.6296 997.2242 1006.7823 1016.9148 1021.2787 1132.6144 1133.5088 1176.4790 1189.4321 1192.1247 1244.0715 1268.6350 1300.3794 1307.1101 1323.2271 1325.0650 1375.6751 1382.4118 1428.8128 1435.0900 1501.7870 1509.8871 1515.4801 1528.8511 1591.8198 1594.3946 1634.1461 1634.3095 1641.3764 1650.7489 1650.9775 3097.4660 3097.5837 3121.9217 3122.0186 3132.2157 3132.3809 3192.8452 3193.1117 3520.1410 3532.5812 3571.0287 3571.2757 3711.8044 3711.8090
redmass: 6.0127 3.5265 4.7359 5.3024 6.5257 4.6230 3.1347 5.0963 6.7836 2.0211 1.7100 1.1902 2.4671 7.2368 1.0521 1.0655 5.8824 3.1154 3.1948 2.8103 2.8354 2.0497 7.4652 2.2941 2.2453 6.4258 1.1874 6.9520 6.9028 12.0445 3.4424 3.4794 5.5740 6.5096 1.4090 1.4070 5.0570 5.8302 1.5550 1.5586 5.9353 1.3826 1.3819 1.3099 1.3055 4.3912 2.8372 2.4430 1.4218 1.6811 1.2230 1.2200 2.0871 1.0965 1.2588 1.8717 1.8504 1.7060 2.0172 1.8543 2.6612 4.4534 5.8997 3.7835 3.7497 2.0977 2.3447 2.9053 3.2338 5.2492 6.2710 1.2944 1.3220 3.5625 3.8760 4.0525 1.0877 1.0877 1.0907 1.0907 1.0953 1.0953 1.0940 1.0939 1.0764 1.0754 1.0446 1.0447 1.1041 1.1041
irintensity: 2.8290 0.0002 0.1125 0.8698 7.7109 11.4384 0.0011 10.8582 0.2517 2.0742 1.7944 632.9062 0.0015 6.6588 8.1158 0.0022 15.8797 0.0013 1.9617 0.0067 0.0000 0.0103 23.1551 60.4408 0.0012 0.4558 150.5504 3.3021 0.4576 16.2207 0.0001 0.0672 11.4739 3.8265 0.0009 80.2730 0.5149 9.2397 0.0228 145.2035 0.5245 0.0000 1.1193 0.0059 5.7355 0.1710 0.0013 0.1295 2.5008 0.6087 0.1387 44.1162 342.0626 0.2057 14.3936 336.6523 27.1953 5.0151 171.2547 4.0448 3.3267 30.0119 234.9958 0.0830 106.4543 25.9517 1446.8755 479.1007 8.6360 58.2753 6.4197 161.2426 1.3365 108.0428 26.6584 191.3224 39.0530 18.5187 8.8473 49.2321 35.6263 17.5102 12.8950 1.4154 12.6850 11.1120 172.0837 7.5523 6.5748 31.0928
temp: 298.150 k
press: 1.00000 atm
elementType: 8 7 7 7 7 6 6 6 6 6 6 6 6 6 6 6 6 6 1 1 1 1 1 1 1 1 1 1 1 1 1 1
symmnumber: 1
zpe: 664574.2 jmol-1
zpe.correction: 0.253123 hartree
zpe.thermalcorrener: 0.270108 hartree
zpe.thermalcorrenthalpy: 0.271052 hartree
zpe.thermalcorrgfe: 0.207756 hartree
zpe.sumelectzpe: -796.764254 hartree
zpe.sumelectthermal: -796.747269 hartree
zpe.sumelectthermalent: -796.746325 hartree
zpe.sumelectthermalfe: -796.809621 hartree
dipole: 0.0019 3.0470 0.0003
dipole: 3.0470
quadrupole: -48.1118 -88.2743 -116.2985
quadrupole: 0.0005 0.0885 -0.0004
quadrupole: 36.1164 -4.0461 -32.0703 0.0005 0.0885 -0.0004
hfenergy: -797.0173765 hartree
pointgroup: C01 [X(C13H14N4O1)]
dipole: 0.0008922 -1.1987734 0.0008201 debye
polarizability: 364.2315868|0.0244407|170.7622247|0.5051996|-0.080453|69.4766708 unknown
InChI: InChI=1S/C13H14N4O/c14-9-1-5-11(6-2-9)16-13(18)17-12-7-3-10(15)4-8-12/h1-8,16-17H,14-15H2
charge 0 multiplicity 1
32 atoms
O  -0.001574 1.190428 -0.000916
N  -1.166703 -0.862215 -0.005788
N  1.164952 -0.861609 0.007028
N  -6.645136 0.684955 -0.011023
N  6.643229 0.686392 0.009892
C  -2.522609 -0.414426 -0.007011
C  2.520775 -0.413439 0.007587
C  -3.541181 -1.403804 -0.009845
C  3.539479 -1.402674 0.012039
C  -2.903593 0.953785 -0.005655
C  2.901645 0.954822 0.004056
C  -0.001097 -0.078291 0.000062
C  -5.293155 0.320009 -0.009657
C  5.291284 0.321304 0.009119
C  -4.902989 -1.049021 -0.011266
C  4.901252 -1.047754 0.012926
C  -4.266551 1.306228 -0.006808
C  4.264572 1.307402 0.004678
H  -1.058522 -1.878364 -0.012557
H  1.057182 -1.877788 0.015297
H  -3.269413 -2.468565 -0.010775
H  3.267836 -2.467462 0.014696
H  -2.12788 1.721343 -0.003943
H  2.125884 1.722305 0.001129
H  -5.667324 -1.835698 -0.013473
H  5.665666 -1.834349 0.016424
H  -4.539355 2.369035 -0.005786
H  4.53727 2.370232 0.001954
H  -7.375913 -0.019547 -0.012255
H  -6.918344 1.662617 -0.008443
H  7.374082 -0.018029 0.01225
H  6.916332 1.664078 0.005666
