program: Gaussian 09
title: 000225701
version: EM64L-G09RevD.01
frameworkgroup: C1[X(C12H11NO5S)]
method: RPBEPBE
basis: SDD
operation: Freq
keyword: #p
keyword: freq=noraman
keyword: PBEPBE/SDD
title: #p freq=noraman PBEPBE/SDD
converged: YES YES NO NO
title: Mulliken charges:
elementType: S O O O O O N C C C C C C C C C C C C H H H H H H H H H H H
charge: 0.964977 -0.538833 -0.563525 -0.503569 -0.505441 -0.247194 -0.456439 0.645537 0.023082 -0.385731 0.339464 -0.274637 0.276176 -0.381441 -0.434297 -0.439127 -0.228288 0.213559 -0.795525 0.294216 0.326253 0.288257 0.223925 0.239193 0.406587 0.385846 0.379011 0.239594 0.268665 0.239705
chargesum: 0.00000
title: Mulliken charges with hydrogens summed into heavy atoms:
elementType: S O O O O O N C C C C C C C C C C C C
charge: 0.964977 -0.152987 -0.184515 -0.503569 -0.505441 -0.247194 -0.049852 0.645537 0.023082 -0.385731 0.339464 0.019579 0.276176 -0.055188 -0.146040 -0.215202 0.010905 0.213559 -0.047561
polarizability: 2.76270516e+02 6.02669821e+00 2.23258943e+02 -1.29235161e+00 9.79472909e-01 9.21323557e+01
1716.lowfreq: -60.5872 -4.0104 -0.0007 -0.0004 0.0004 2.4975 6.9477 34.8089 53.8027
frequency: -60.5644 34.7814 53.7982 58.3726 82.4133 116.7193 134.6660 155.4843 164.1334 173.0508 196.7043 213.1398 240.7534 259.0935 279.9133 305.3360 321.3198 329.6836 349.4276 379.3797 387.6556 423.5164 472.1565 484.6638 496.4218 505.0894 526.9236 544.0349 581.8728 583.4807 596.9647 644.5795 652.5437 742.4079 766.5628 770.9403 815.0232 833.4833 835.5141 864.4995 880.7132 883.4759 905.6366 958.0476 975.7294 980.1961 1001.4310 1013.8318 1034.7682 1043.1672 1050.4411 1110.5561 1153.9718 1180.0134 1192.4055 1213.9271 1243.9633 1257.8826 1310.0681 1345.6610 1377.5266 1382.0400 1400.5682 1440.4569 1443.1939 1452.8934 1466.2717 1513.6867 1551.0418 1584.3493 1605.0250 1630.0792 1653.3402 2990.1066 3075.3701 3120.5441 3138.5940 3157.4777 3160.0301 3183.8645 3193.6747 3357.2262 3476.8143 3606.3608
redmass: 1.0335 7.9137 5.5631 6.2278 5.4330 6.3322 6.3343 5.7270 3.9964 1.8600 5.3371 5.6646 3.5863 3.8978 6.0731 8.1522 6.6165 5.4756 1.1875 6.3943 6.5476 7.2418 3.5759 5.2675 5.4615 5.0687 5.6020 9.7919 7.0879 3.0781 5.4853 5.0098 2.8847 6.5566 1.4861 5.8736 6.2016 10.0215 2.8004 1.2052 1.4883 1.5491 5.1705 12.0795 1.3981 1.9916 1.3497 3.7929 1.6734 1.1781 3.3836 1.9469 1.7732 1.2886 1.3036 2.0498 2.6390 2.3080 2.5619 3.6684 1.2517 5.3169 3.1223 2.1189 2.0874 1.3678 1.0466 3.1463 2.7700 7.7702 5.4775 6.8377 2.4818 1.0382 1.0982 1.0903 1.0984 1.0915 1.0912 1.0978 1.0947 1.0802 1.0661 1.0663
irintensity: 0.6076 0.3942 0.9425 0.5807 3.8121 1.9634 0.9478 11.2320 7.7572 29.8609 3.3318 8.1379 30.9782 10.6680 18.7825 36.7790 22.0490 2.7135 118.8690 1.6319 68.7830 43.4905 4.8867 6.1891 20.1594 4.4837 5.4367 115.9629 49.2373 1.0382 23.7474 13.6651 2.5087 3.1157 80.2273 5.3802 33.5402 60.4067 3.0681 91.0245 14.5220 45.2904 13.1185 83.9333 3.2220 18.8992 2.3651 141.7348 11.9406 111.2752 3.7992 8.8117 39.9658 22.6475 7.8578 91.3548 47.8251 15.6612 178.2050 151.0950 50.0702 58.1533 170.1097 15.7565 24.7233 36.7555 19.5098 72.2855 645.8975 41.5341 95.0633 80.8891 18.3661 5.5455 13.1721 14.9388 8.5867 6.3823 8.7522 7.0359 18.8538 189.4282 40.7722 60.2925
temp: 298.150 k
press: 1.00000 atm
elementType: 16 8 8 8 8 8 7 6 6 6 6 6 6 6 6 6 6 6 6 1 1 1 1 1 1 1 1 1 1 1
symmnumber: 1
zpe: 556699.7 jmol-1
zpe.correction: 0.212036 hartree
zpe.thermalcorrener: 0.229711 hartree
zpe.thermalcorrenthalpy: 0.230655 hartree
zpe.thermalcorrgfe: 0.166355 hartree
zpe.sumelectzpe: -1291.287876 hartree
zpe.sumelectthermal: -1291.270201 hartree
zpe.sumelectthermalent: -1291.269257 hartree
zpe.sumelectthermalfe: -1291.333556 hartree
dipole: -5.6559 7.2399 1.3828
dipole: 9.2907
quadrupole: -109.8195 -111.3134 -123.9554
quadrupole: -10.8571 9.0534 -0.1826
quadrupole: 5.2099 3.7160 -8.9260 -10.8571 9.0534 -0.1826
hfenergy: -1291.4999113 hartree
pointgroup: C01 [X(C12H11N1O5S1)]
dipole: 1.9704683 -3.034583 0.5189087 debye
polarizability: 276.9019358|1.1656206|222.5986485|-2.2228951|-1.5958102|92.1612303 unknown
InChI: InChI=1S/C12H11NO5S/c1-7(14)13-9-5-6-11(19(16,17)18)8-3-2-4-10(15)12(8)9/h2-6,13,15-16H,1H3
charge 0 multiplicity 1
30 atoms
S  -3.257618 1.231579 -0.034424
O  2.313543 -2.366449 0.027881
O  -3.578928 0.741494 1.736599
O  -3.423985 2.833459 -0.184187
O  -4.163913 0.260809 -0.965688
O  3.590258 2.40662 -0.046714
N  2.746651 0.201296 -0.014659
C  -0.977489 -0.549647 -0.013862
C  0.467272 -0.753309 -0.007589
C  -1.434786 0.807893 -0.035391
C  1.351742 0.407655 -0.021675
C  -0.588089 1.910062 -0.041147
C  0.914364 -2.123637 0.019457
C  0.810829 1.709895 -0.043238
C  -1.869745 -1.671176 -0.000682
C  0.030638 -3.204832 0.036438
C  -1.37103 -2.971582 0.025423
C  3.775229 1.155884 -0.02612
C  5.169047 0.531056 -0.011589
H  -1.003389 2.922696 -0.051076
H  1.493608 2.560028 -0.054672
H  -2.947713 -1.49925 -0.026872
H  0.416822 -4.231798 0.0567
H  -2.057984 -3.823215 0.035032
H  3.031296 -0.789862 0.003279
H  2.510076 -3.333634 0.04736
H  -4.557068 0.877086 1.905018
H  5.319393 -0.086354 0.893248
H  5.916651 1.336701 -0.021651
H  5.325519 -0.114366 -0.895598
