program: Gaussian 09
title: 000225699
version: EM64L-G09RevD.01
frameworkgroup: C1[X(C13H24O)]
method: RPBEPBE
basis: SDD
operation: Freq
keyword: #pfreq=noraman
keyword: PBEPBE/SDD
title: #p freq=noraman PBEPBE/SDD
converged: YES YES NO NO
title: Mulliken charges:
elementType: O C C C C C C C C C C C C C H H H H H H H H H H H H H H H H H H H H H H H H
charge: -0.236593 -0.392786 -0.043278 -0.414207 -0.363836 -0.025837 -0.501191 -0.742571 -0.716015 -0.713606 -0.077482 -0.314294 0.190466 -0.782337 0.214131 0.189932 0.204400 0.210038 0.202016 0.185689 0.190320 0.191623 0.208193 0.214966 0.212426 0.215869 0.218777 0.203720 0.216945 0.211788 0.211385 0.212976 0.206662 0.265671 0.224453 0.233498 0.234112 0.253978
chargesum: 0.00000
title: Mulliken charges with hydrogens summed into heavy atoms:
elementType: O C C C C C C C C C C C C C
charge: -0.236593 0.011277 0.161121 -0.002152 0.012173 0.165786 -0.078032 -0.095499 -0.083563 -0.082583 0.188188 -0.089841 0.190466 -0.060748
polarizability: 1.48890673e+02 1.09224036e+01 1.67502787e+02 5.09136156e+00 -2.98046283e+00 1.22377163e+02
1716.lowfreq: -17.1216 -12.3098 -0.0003 0.0004 0.0005 4.6933 15.0795 31.8421 36.4202
frequency: 13.3352 31.6404 35.6942 57.6764 77.9030 92.8185 101.8732 111.6906 121.5646 137.4917 180.2427 195.0708 207.2497 234.9817 244.7848 260.3533 279.0284 294.6187 366.5557 372.0490 404.9896 420.8064 432.8351 460.1540 549.2004 565.4584 603.1355 727.1072 771.5287 797.8548 826.1811 832.8016 881.4222 916.4363 921.9938 928.8707 932.8508 947.9662 951.2431 978.5969 984.6117 1002.5576 1025.9682 1032.3833 1041.6879 1061.0204 1104.2251 1133.3911 1140.0949 1163.7676 1167.7301 1175.8258 1198.9358 1207.4162 1242.5905 1257.2441 1274.7529 1289.8499 1292.2655 1298.9970 1317.2686 1326.8788 1331.0181 1342.1483 1346.4824 1361.5869 1367.3978 1378.1873 1387.4292 1394.8675 1442.5619 1449.0829 1454.7975 1455.3714 1455.9686 1468.5781 1471.2532 1475.1589 1477.6739 1481.7702 1485.8289 1489.1921 1582.8017 1657.0964 2943.5489 2947.8490 2951.6381 2952.2049 2964.1247 2964.7443 2969.5491 2971.4575 2974.1299 2977.3512 2993.9474 3004.9428 3024.7728 3039.2915 3056.1461 3059.4189 3063.1136 3066.5929 3066.8516 3071.9259 3074.4934 3079.7796 3104.8491 3124.1642
redmass: 4.2464 3.2816 2.6420 3.2569 3.6444 2.4054 1.0888 1.9667 2.8017 2.4484 2.5190 1.2014 2.2984 1.1115 1.1433 2.4996 2.7687 2.7761 2.2807 2.2292 2.6114 2.2927 2.4186 2.8919 2.5095 2.4749 3.7627 1.1344 2.4526 1.5465 1.8823 1.9380 2.5642 1.1949 1.8619 1.6226 1.8287 1.4199 1.7091 2.0045 1.6726 1.1780 1.8214 1.5695 1.7873 2.3797 1.9590 2.0968 2.2051 1.7726 1.6864 1.7536 1.7872 1.6086 1.3553 1.3008 1.2219 1.2452 1.1649 1.3919 1.5556 1.5513 1.4314 1.5196 1.5006 1.4443 1.2695 1.2267 1.2164 1.2160 1.0872 1.0991 1.0696 1.0518 1.0789 1.0447 1.0572 1.0491 1.0956 1.0549 1.0554 1.0512 7.6272 6.1903 1.0636 1.0715 1.0636 1.0779 1.0617 1.0413 1.0368 1.0592 1.0390 1.0375 1.0979 1.1019 1.0968 1.1039 1.0993 1.0963 1.0991 1.0992 1.0993 1.0992 1.0981 1.0904 1.0909 1.0993
irintensity: 0.4026 4.8216 0.7557 0.2569 2.1548 0.0823 0.0724 0.0589 0.1584 0.6609 1.5329 0.3642 0.7257 0.0656 0.0412 0.1394 0.5391 0.1366 0.4902 0.6762 1.9400 1.2978 0.4954 5.7885 3.8894 3.3245 10.2177 7.2943 1.6373 1.8599 2.0444 4.8670 1.4975 4.6774 9.8059 5.5228 11.8625 2.3430 17.8681 1.3085 3.8179 52.4244 2.9316 1.3818 14.7865 1.0402 2.2180 0.4896 2.0985 3.6140 30.3624 13.8738 36.7291 9.4133 8.5323 31.5121 1.2030 6.6826 0.3906 2.6706 65.1526 5.8148 5.5843 2.9347 3.2285 1.6412 68.9416 21.5257 20.8949 12.6199 27.3723 12.5914 0.5362 15.1599 8.0621 2.9905 3.7320 13.1716 4.3961 8.0443 13.2180 28.0030 179.1770 102.1060 9.6419 10.6654 25.8315 19.4179 24.6890 40.2981 24.9861 67.2027 41.2223 3.6381 11.9995 1.1044 36.0445 92.8145 7.3010 15.7721 84.1400 78.8502 42.4642 44.4227 55.3671 8.1225 17.4343 19.2609
temp: 298.150 k
press: 1.00000 atm
elementType: 8 6 6 6 6 6 6 6 6 6 6 6 6 6 1 1 1 1 1 1 1 1 1 1 1 1 1 1 1 1 1 1 1 1 1 1 1 1
symmnumber: 1
zpe: 886496.6 jmol-1
zpe.correction: 0.337649 hartree
zpe.thermalcorrener: 0.356069 hartree
zpe.thermalcorrenthalpy: 0.357013 hartree
zpe.thermalcorrgfe: 0.288735 hartree
zpe.sumelectzpe: -583.846307 hartree
zpe.sumelectthermal: -583.827887 hartree
zpe.sumelectthermalent: -583.826943 hartree
zpe.sumelectthermalfe: -583.895221 hartree
dipole: 2.4178 0.7340 2.3822
dipole: 3.4726
quadrupole: -103.1825 -83.1439 -91.8057
quadrupole: -1.1198 -9.1719 -3.6628
quadrupole: -10.4718 9.5668 0.9050 -1.1198 -9.1719 -3.6628
hfenergy: -584.1839557 hartree
pointgroup: C01 [X(C13H24O1)]
dipole: -0.9472123 -0.298067 0.9383866 debye
polarizability: 149.0212303|11.2122804|167.1697117|-5.0372256|3.8077996|122.5796807 unknown
InChI: InChI=1S/C13H24O/c1-11(2)7-5-8-12(3)9-6-10-13(4)14/h6,10-12H,5,7-9H2,1-4H3
charge 0 multiplicity 1
38 atoms
O  3.863339 1.145509 -1.217731
C  -0.706397 -1.45378 -0.919236
C  0.265352 -2.495295 -0.294909
C  -1.632714 -0.704628 0.067786
C  -2.569059 0.282235 -0.667433
C  -3.587725 1.028221 0.235314
C  1.281467 -1.853919 0.704724
C  -0.480246 -3.667432 0.386427
C  -2.890467 1.958347 1.258125
C  -4.585578 1.832186 -0.632271
C  2.150844 -0.798367 0.075326
C  2.321611 0.478229 0.526506
C  3.216089 1.450234 -0.170834
C  3.310743 2.842654 0.445316
H  -0.111943 -0.703375 -1.480035
H  -1.334938 -1.97651 -1.670239
H  0.860857 -2.91668 -1.13371
H  -1.017537 -0.154268 0.80609
H  -2.247225 -1.428741 0.640449
H  -3.129874 -0.278663 -1.444976
H  -1.954992 1.033095 -1.20979
H  -4.162408 0.263648 0.802073
H  1.934712 -2.671575 1.079651
H  0.747264 -1.447643 1.584406
H  0.22652 -4.455108 0.708778
H  -1.033236 -3.329181 1.282249
H  -1.209099 -4.127725 -0.306151
H  -2.266013 2.70914 0.735026
H  -2.23818 1.396654 1.951046
H  -3.634881 2.504558 1.867281
H  -5.33995 2.345155 -0.006816
H  -5.120755 1.174461 -1.342757
H  -4.054728 2.604702 -1.222285
H  2.704006 -1.079154 -0.836214
H  1.799455 0.828699 1.42804
H  2.311241 3.317317 0.481223
H  3.675248 2.779543 1.488645
H  3.9940 3.473255 -0.143594
