program: Gaussian 09
title: 000225705
version: EM64L-G09RevD.01
frameworkgroup: C1[X(C14H9NO6)]
method: RPBEPBE
basis: SDD
operation: Freq
keyword: #p
keyword: freq=noraman
keyword: PBEPBE/SDD
title: #p freq=noraman PBEPBE/SDD
converged: YES YES NO NO
title: Mulliken charges:
elementType: O O O O O O N C C C C C C C C C C C C C C H H H H H H H H H
charge: -0.197541 -0.364632 -0.432286 -0.240634 -0.214304 -0.171035 0.012418 0.421550 0.259049 -0.005803 0.096786 -0.480521 -0.363088 0.281850 -0.357919 0.172712 -0.357122 -0.327804 -0.220683 -0.216360 0.092813 0.302937 0.284303 0.264041 0.232359 0.283701 0.241593 0.241163 0.371038 0.391414
chargesum: 0.00000
title: Mulliken charges with hydrogens summed into heavy atoms:
elementType: O O O O O O N C C C C C C C C C C C C C C
charge: -0.197541 0.006407 -0.040872 -0.240634 -0.214304 -0.171035 0.012418 0.421550 0.259049 -0.005803 0.096786 -0.177584 -0.078784 0.281850 -0.093878 0.172712 -0.124763 -0.044103 0.020910 0.024803 0.092813
polarizability: 2.33575907e+02 -2.10183887e+01 1.84431916e+02 -2.98188796e+01 -6.58379750e-01 1.42596596e+02
1716.lowfreq: -2.0600 0.0006 0.0007 0.0007 5.8104 8.1739 20.1437 23.7167 29.4084
frequency: 20.0323 23.6026 29.3952 45.6396 71.4700 101.0813 115.3099 119.1868 160.3311 170.3993 228.8061 240.4424 258.6970 299.4747 324.5994 350.0796 376.3319 384.8746 408.1351 414.0928 422.3667 444.9981 491.4653 524.4706 544.2832 572.8767 594.6815 597.7671 617.6207 654.0295 661.8223 687.1967 702.2110 725.5570 738.2599 763.5781 767.6513 782.1775 792.2681 827.8825 853.6304 897.6177 942.0270 946.3973 977.0318 984.1800 1006.7955 1008.2307 1042.6433 1057.1793 1101.3193 1120.2360 1159.2580 1164.2148 1166.2312 1180.3200 1201.7255 1257.7792 1266.0251 1279.9605 1302.9885 1325.4135 1357.3506 1380.0025 1398.7950 1424.8462 1428.8746 1475.6273 1495.0983 1554.2036 1575.3729 1588.4998 1601.0973 1622.4915 1630.2425 3121.6999 3140.3094 3154.2784 3167.6374 3168.0019 3169.8986 3183.4263 3531.9616 3540.6077
redmass: 7.6062 8.2722 11.7679 7.2433 11.2276 7.5425 5.6952 6.1704 6.6095 7.2196 6.0884 6.8724 7.1079 7.5088 9.1186 8.4910 7.1001 6.9259 4.2772 2.3549 2.5883 1.8034 5.9833 4.5470 4.6479 4.0525 1.3018 4.0958 7.1157 7.0672 6.3505 3.9412 7.6599 3.9825 4.6823 5.4255 6.4632 2.6912 2.0914 1.5828 7.0585 1.4652 2.4192 2.2613 1.4115 1.3641 1.4440 4.2351 2.3299 2.7175 2.1282 1.5579 2.3401 1.7427 1.2741 1.0729 8.3874 2.1582 2.6970 1.4914 2.0947 2.6838 7.4823 10.3763 5.1538 4.8124 2.5175 2.6556 3.1849 9.8313 6.9833 7.3374 6.2711 7.0673 8.6119 1.0902 1.0864 1.0913 1.0967 1.0922 1.0942 1.0977 1.0643 1.0659
irintensity: 0.3312 4.0933 2.0033 3.8017 0.1501 2.8646 0.4972 2.8981 1.2730 3.9717 3.2718 1.0495 2.1081 7.5378 1.1699 4.8594 6.1473 12.0679 3.8991 37.9800 40.2773 54.7812 7.0060 16.5045 20.1033 9.9147 95.1128 33.2536 35.4872 14.9889 4.2533 74.6095 15.3048 52.6028 8.6804 11.4369 11.3951 34.3785 18.5374 30.4596 4.7642 2.2321 63.6640 24.4933 2.3969 3.2079 20.9041 209.1722 4.9044 93.0459 82.3782 105.1134 46.0021 58.9158 12.7526 0.3192 250.3173 263.6709 24.3197 53.7800 69.3957 89.4156 35.7960 12.8427 138.1542 9.4117 20.0358 10.8016 8.9797 125.1142 23.9909 104.2808 27.4541 124.2232 221.2118 12.2272 1.3948 7.6631 13.6771 1.6296 3.9511 8.6191 56.7623 67.6300
temp: 298.150 k
press: 1.00000 atm
elementType: 8 8 8 8 8 8 7 6 6 6 6 6 6 6 6 6 6 6 6 6 6 1 1 1 1 1 1 1 1 1
symmnumber: 1
zpe: 538359.5 jmol-1
zpe.correction: 0.205050 hartree
zpe.thermalcorrener: 0.223109 hartree
zpe.thermalcorrenthalpy: 0.224053 hartree
zpe.thermalcorrgfe: 0.156197 hartree
zpe.sumelectzpe: -1043.430490 hartree
zpe.sumelectthermal: -1043.412431 hartree
zpe.sumelectthermalent: -1043.411487 hartree
zpe.sumelectthermalfe: -1043.479343 hartree
dipole: 0.8887 2.0922 0.4251
dipole: 2.3125
quadrupole: -102.0106 -133.4807 -107.9399
quadrupole: -33.7310 -4.8957 -2.7798
quadrupole: 12.4665 -19.0036 6.5371 -33.7310 -4.8957 -2.7798
hfenergy: -1043.6355403 hartree
pointgroup: C01 [X(C14H9N1O6)]
dipole: -0.3748102 0.8194257 0.1257092 debye
polarizability: 227.3741889|32.1382338|182.4299282|-28.2483057|9.6765507|150.8003012 unknown
InChI: InChI=1S/C14H9NO6/c16-12-6-5-8(7-11(12)15(20)21)13(17)9-3-1-2-4-10(9)14(18)19/h1-7,16,18H
charge 0 multiplicity 1
30 atoms
O  -1.143553 2.416057 1.567548
O  4.66174 0.403625 -0.401775
O  -2.351608 -0.180462 -2.858392
O  -1.145578 1.466733 -1.758311
O  1.967619 -2.779889 -0.078228
O  3.851422 -2.039569 -1.126599
N  2.774095 -1.835769 -0.453215
C  0.589595 1.064282 0.587454
C  -1.873174 0.249444 0.81165
C  -0.827686 1.337086 0.984865
C  -2.348698 -0.212174 -0.452176
C  1.044837 -0.224976 0.247609
C  1.519318 2.141023 0.59278
C  2.39496 -0.448509 -0.09878
C  -2.415114 -0.31167 1.992794
C  3.329282 0.629026 -0.09687
C  2.860228 1.925245 0.258388
C  -3.324157 -1.241288 -0.51093
C  -3.382529 -1.338666 1.927795
C  -3.832286 -1.811152 0.673133
C  -1.877064 0.447135 -1.699408
H  0.375059 -1.089749 0.253363
H  1.156674 3.137334 0.863806
H  -2.072035 0.061722 2.96294
H  3.569181 2.763243 0.264552
H  -3.678895 -1.571894 -1.490575
H  -3.783224 -1.766171 2.853045
H  -4.581418 -2.607663 0.61988
H  5.187218 1.24045 -0.31254
H  -2.01661 0.315196 -3.653001
