program: Gaussian 09
title: 000225678
version: EM64L-G09RevD.01
frameworkgroup: C1[X(C6H9NO2)]
method: RPBEPBE
basis: SDD
operation: Freq
keyword: #pfreq=noraman
keyword: PBEPBE/SDD
title: #p freq=noraman PBEPBE/SDD
converged: NO NO NO NO
title: Mulliken charges:
elementType: O O N C C C C C C H H H H H H H H H
charge: -0.204984 -0.199251 -0.367989 0.233750 -0.571449 0.129063 -0.719947 -0.719993 0.155775 0.266793 0.266852 0.222656 0.220561 0.246598 0.220522 0.222602 0.246651 0.351789
chargesum: 0.00000
title: Mulliken charges with hydrogens summed into heavy atoms:
elementType: O O N C C C C C C
charge: -0.204984 -0.199251 -0.016200 0.233750 -0.037804 0.129063 -0.030131 -0.030218 0.155775
polarizability: 9.10173983e+01 5.03373686e+00 7.47639909e+01 -3.73430444e-03 3.75976043e-03 5.59539461e+01
1716.lowfreq: -0.0008 -0.0007 -0.0006 2.0050 10.3928 16.0137 34.0392 147.7935 216.1387
frequency: 32.0069 147.7859 216.1341 238.3506 259.7397 286.4359 314.0620 368.4875 375.4839 531.5126 542.0062 574.1591 615.1799 705.5659 713.0981 770.0726 864.4853 896.7250 901.9048 955.7548 977.3917 1019.7520 1106.1773 1119.1665 1204.0573 1228.9737 1233.5324 1252.6953 1298.7899 1326.3015 1383.2406 1401.8081 1444.2453 1463.9339 1471.8219 1481.8791 1490.0317 1664.4544 1701.9227 2974.6974 2976.5587 3017.2092 3067.9635 3072.4812 3073.1388 3085.8076 3089.4592 3531.2196
redmass: 3.1048 8.9689 2.9866 1.0464 1.3795 2.2180 2.4181 1.9664 5.8451 2.7315 4.0497 4.1395 7.9167 2.6672 4.2185 1.6805 3.4547 2.3706 1.9473 1.3804 1.7883 1.3429 1.5845 2.9030 1.9449 2.0862 3.1482 5.5021 2.3659 1.7484 1.1830 1.1994 1.0821 1.0460 1.0493 1.0560 1.0579 7.5225 12.3223 1.0351 1.0358 1.0614 1.1010 1.0998 1.1016 1.1003 1.0996 1.0790
irintensity: 0.2374 11.6582 0.0969 0.0068 1.8144 4.6915 0.8878 0.5782 15.2511 2.4831 19.3181 2.1324 2.8602 21.9763 13.7644 113.3376 5.2205 10.1665 4.5197 1.4089 3.0825 0.2168 1.7189 129.3998 47.2595 2.2508 54.3613 118.8166 26.4328 15.7415 16.6319 19.5772 16.6513 2.7707 6.3062 14.0586 13.3024 627.1840 60.0974 29.2682 15.1468 6.7182 10.6602 38.4233 8.0278 4.0333 29.3789 45.5178
temp: 298.150 k
press: 1.00000 atm
elementType: 8 8 7 6 6 6 6 6 6 1 1 1 1 1 1 1 1 1
symmnumber: 1
zpe: 379620.9 jmol-1
zpe.correction: 0.144590 hartree
zpe.thermalcorrener: 0.153463 hartree
zpe.thermalcorrenthalpy: 0.154407 hartree
zpe.thermalcorrgfe: 0.110609 hartree
zpe.sumelectzpe: -438.580349 hartree
zpe.sumelectthermal: -438.571476 hartree
zpe.sumelectthermalent: -438.570532 hartree
zpe.sumelectthermalfe: -438.614330 hartree
dipole: 1.5664 -1.9474 0.0003
dipole: 2.4992
quadrupole: -65.9094 -54.5079 -51.4965
quadrupole: -9.0120 0.0024 0.0027
quadrupole: -8.6048 2.7967 5.8081 -9.0120 0.0024 0.0027
hfenergy: -438.7249391 hartree
pointgroup: C01 [X(C6H9N1O2)]
dipole: -0.5466502 0.8171077 0.0174068 debye
dipolederiv: -0.8475054 -0.2544917 0.0651527 -0.3661 -0.8531986 0.0630067 0.0707992 0.051688 -0.3518744 -1.2701343 -0.118948 0.1028169 -0.0005859 -0.504762 0.0080877 0.0968779 0.0204329 -0.3536983 -1.4354279 -0.3762565 0.1360387 -0.3899975 -0.7188435 0.0608389 0.1366933 0.0593815 -0.3286745 0.0373333 0.087145 0.0019551 0.0994421 -0.229841 0.0053995 0.0014912 0.0063332 0.0956048 -0.1863275 0.1616912 0.0179902 0.2124549 -0.2416349 -0.0070657 0.0154126 -0.0015458 0.0612057 1.690863 0.3195891 -0.1768933 0.0048452 1.0101971 -0.0421125 -0.1615151 -0.0752437 0.168116 0.0312076 -0.0355339 0.0125585 0.0068696 0.047964 -0.018469 -0.0032248 0.0403783 0.0125076 0.028672 -0.0447028 -0.0119587 0.0101369 0.0459788 0.013551 -0.0010764 -0.0348914 0.0170093 1.6569611 0.2287436 -0.1644575 0.5008773 1.1609046 -0.1003269 -0.1776773 -0.0718748 0.213545 0.0501515 -0.0047271 -0.0330125 -0.029058 0.0462079 -0.0614716 -0.0505009 -0.0969106 0.0076521 0.0652408 0.0175621 0.0185045 -0.0117269 0.0617251 0.0594774 0.0386748 0.0892248 -0.0229029 -0.0059767 0.0256217 -0.1325583 0.0307381 0.0832516 0.0300784 -0.0815982 0.0140695 -0.0770367 0.0768056 0.0482615 0.0207326 0.0709803 -0.1390988 -0.0181393 0.0142432 0.0219138 0.0650654 -0.0651308 -0.0605824 0.050843 -0.1106977 0.056197 0.01856 0.0134355 -0.0146305 0.0855763 0.0678814 0.0427465 -0.0258275 0.0738702 -0.1385964 0.0229828 -0.0218253 -0.011482 0.07357 0.0339904 0.0318748 0.1066888 0.028709 0.0768975 -0.0532276 0.0555725 -0.0370594 -0.1107848 -0.0696255 -0.0589594 -0.0118331 -0.1112382 0.0576921 0.0079113 0.0305191 0.0304289 0.088784 0.1410215 -0.0090337 0.0232601 -0.0195194 0.1789595 0.010919 0.0236987 0.0097872 0.3563352 unknown
polarizability: 91.3601932|3.3952849|73.9560433|-3.8678756|-1.2388482|56.4190989 unknown
InChI: InChI=1S/C6H9NO2/c1-6(2)3-4(8)7-5(6)9/h7H,3H2,1-2H3
charge 0 multiplicity 1
18 atoms
O  -1.363792 -1.86225 0.225005
O  2.864456 0.097816 -0.312998
N  0.871123 -1.143543 -0.04347
C  -0.793345 0.581545 0.046211
C  0.621046 1.20948 -0.133961
C  -0.52098 -0.947028 0.092063
C  -1.466828 1.0035 1.378196
C  -1.734325 0.880268 -1.15008
C  1.62077 0.047646 -0.180669
H  0.898001 1.882658 0.696785
H  0.712776 1.794449 -1.066413
H  -0.808016 0.808453 2.245243
H  -1.702128 2.084284 1.359441
H  -2.406423 0.442528 1.528559
H  -1.972963 1.959884 -1.185669
H  -1.268293 0.597576 -2.112754
H  -2.677938 0.315438 -1.047265
H  1.303458 -2.072506 -0.042923
