program: Gaussian 09
title: 000225643
version: EM64L-G09RevD.01
frameworkgroup: C1[X(C24H17N)]
method: RPBEPBE
basis: SDD
operation: Freq
keyword: #pfreq=noraman
keyword: PBEPBE/SDD
title: #p freq=noraman PBEPBE/SDD
converged: YES YES NO NO
title: Mulliken charges:
elementType: N C C C C C C C C C C C C C C C C C C C C C C C C H H H H H H H H H H H H H H H H H
charge: -0.066779 -0.694569 0.305315 0.180779 0.278477 0.179023 -0.577718 -0.394519 -0.422059 -0.394339 0.238942 -0.361241 -0.237426 -0.235631 0.215307 0.282967 0.408335 -0.385465 -0.396324 -0.362264 -0.439151 -0.425370 -0.238295 -0.259012 -0.246582 0.245772 0.246460 0.266284 0.237890 0.241147 0.237789 0.240353 0.225344 0.225319 0.209945 0.280728 0.222218 0.240052 0.238343 0.230728 0.228660 0.230563
chargesum: 0.00000
title: Mulliken charges with hydrogens summed into heavy atoms:
elementType: N C C C C C C C C C C C C C C C C C C C C C C C C
charge: -0.066779 -0.202337 0.305315 0.180779 0.278477 0.179023 -0.311434 -0.156629 -0.180912 -0.156550 0.238942 -0.120888 -0.012082 -0.010311 0.215307 0.282967 0.408335 -0.175520 -0.115596 -0.140045 -0.199098 -0.187027 -0.007567 -0.030352 -0.016019
polarizability: 6.35089957e+02 -6.40763315e+00 2.71957817e+02 -4.76412581e+00 -6.49666852e+00 1.23825317e+02
1716.lowfreq: -4.0548 0.0002 0.0003 0.0010 3.0058 6.4019 17.6875 28.6299 36.7285
frequency: 17.2412 28.3458 36.7239 73.5563 105.8680 132.0260 146.5972 160.5200 169.9335 183.7534 222.9372 241.0247 245.1239 278.6439 357.9929 363.8265 416.0713 422.4144 430.2261 437.4807 456.1659 475.0185 496.9429 504.1521 512.4911 531.8238 542.1018 556.0331 576.3976 601.1843 636.0343 648.4788 652.5215 709.4437 710.6404 740.8850 743.9889 746.3499 775.8333 783.9276 788.7703 797.5424 818.5072 821.9820 830.2459 867.5015 870.8371 883.3581 893.0681 924.5163 937.0165 940.5635 950.2216 962.7882 966.1268 969.7417 984.8672 992.7835 994.0433 1002.6095 1014.9806 1025.0928 1036.8097 1087.2698 1094.9126 1115.5576 1131.2493 1143.5328 1153.1356 1168.3407 1175.2506 1184.9946 1187.5652 1201.0352 1206.4188 1236.7863 1241.2829 1263.4888 1278.0738 1291.0327 1306.9747 1348.7488 1364.3623 1388.1404 1391.9598 1406.1922 1415.7509 1426.2652 1440.0520 1444.1199 1445.5041 1458.8275 1461.4487 1486.3038 1520.6895 1557.0830 1568.2107 1587.2330 1589.8815 1595.4296 1620.3107 1628.2390 1632.2388 2983.4424 2990.4076 3027.7410 3120.9479 3122.6216 3123.7851 3124.9183 3128.3571 3133.9356 3141.8309 3145.5783 3146.1934 3150.4508 3151.5451 3160.7625 3164.1333 3165.9395
redmass: 4.3834 5.5511 5.2889 5.0341 5.1366 3.6705 4.5296 3.9612 6.4552 3.8313 4.4142 2.4359 3.3674 4.0552 4.7387 5.6094 3.0919 4.1519 3.3399 2.8724 4.8830 3.2627 5.3957 3.4514 6.2094 4.5270 4.5513 4.0439 6.9391 3.0864 6.4244 4.3205 4.1435 3.6127 4.0262 1.9949 3.3170 1.3492 2.2527 4.7105 1.9061 4.3645 1.4529 4.4159 1.7304 1.5241 2.9006 1.7997 1.5603 3.4239 1.4931 1.4070 1.4000 1.6074 1.4367 1.8713 1.3377 1.6158 3.5740 1.4016 3.9530 2.1423 2.2543 2.0471 2.1363 1.8332 1.1526 1.4717 1.3926 1.1377 1.1105 1.2653 1.5988 1.8880 2.4437 1.8640 1.8658 1.9848 1.9369 1.5943 1.9933 2.2106 3.7282 4.5137 2.2088 2.7532 4.4161 1.1683 2.6171 2.5676 2.9894 2.7564 2.9417 3.8139 3.7704 5.9439 6.8922 6.4368 6.5896 6.0385 7.2881 7.3344 6.4893 1.0608 1.0850 1.0993 1.0853 1.0866 1.0868 1.0868 1.0894 1.0884 1.0947 1.0958 1.0921 1.0932 1.0941 1.1003 1.0978 1.0997
irintensity: 0.1665 0.3117 0.1651 0.0043 1.2640 0.7187 1.0707 4.7392 0.1923 3.3231 11.8407 9.7928 11.0356 1.6665 4.5270 2.3363 5.2172 8.7795 19.3200 2.9544 0.5318 2.5769 3.3520 1.6987 1.4673 1.9894 2.3852 3.5916 3.7451 2.3952 15.4619 7.8983 0.3581 0.3882 2.3772 39.4675 10.3625 15.7089 61.7771 4.9237 72.7113 10.9861 42.7620 1.7363 28.6616 0.7007 3.6976 4.9192 14.2855 9.4477 4.3038 1.1314 0.4497 20.0327 0.4175 11.4159 0.3283 0.2133 4.2693 5.0311 5.9436 5.8924 10.0861 3.7946 3.4214 7.9684 0.2200 2.8594 1.0896 1.5985 0.9877 0.7591 2.2722 9.3415 5.6015 5.9576 41.1878 5.1316 9.4390 3.0045 1.9981 6.1207 21.5088 8.1350 4.2262 0.5260 1.9940 20.1554 1.5286 40.6308 18.6592 9.6202 8.4244 21.1877 8.7038 58.3167 1.0991 1.7822 0.7657 12.4131 2.7275 3.7980 4.8880 13.4369 36.6255 7.4644 7.4383 1.9530 12.5689 1.8544 1.6998 5.3744 25.4567 22.6966 19.4609 2.3371 44.3093 55.2390 28.4158 23.8582
temp: 298.150 k
press: 1.00000 atm
elementType: 7 6 6 6 6 6 6 6 6 6 6 6 6 6 6 6 6 6 6 6 6 6 6 6 6 1 1 1 1 1 1 1 1 1 1 1 1 1 1 1 1 1
symmnumber: 1
zpe: 869512.7 jmol-1
zpe.correction: 0.331180 hartree
zpe.thermalcorrener: 0.349900 hartree
zpe.thermalcorrenthalpy: 0.350844 hartree
zpe.thermalcorrgfe: 0.282719 hartree
zpe.sumelectzpe: -977.861020 hartree
zpe.sumelectthermal: -977.842299 hartree
zpe.sumelectthermalent: -977.841355 hartree
zpe.sumelectthermalfe: -977.909480 hartree
dipole: 0.6789 0.6918 0.3884
dipole: 1.0442
quadrupole: -116.7182 -128.1960 -151.0519
quadrupole: 2.5486 -2.1172 -3.3949
quadrupole: 15.2705 3.7927 -19.0632 2.5486 -2.1172 -3.3949
hfenergy: -978.1921995 hartree
pointgroup: C01 [X(C24H17N1)]
dipole: 0.2585044 -0.2683369 0.1730045 debye
polarizability: 635.121332|2.0469117|152.2775709|6.9067627|-58.7107643|243.4741879 unknown
InChI: InChI=1S/C24H17N/c1-3-10-22-17(6-1)8-5-9-19(22)16-25-21-12-13-24-20(15-21)14-18-7-2-4-11-23(18)24/h1-13,15-16H,14H2
charge 0 multiplicity 1
42 atoms
N  0.793859 0.537846 -0.690504
C  -4.104366 0.108413 -1.919935
C  -2.885582 0.169211 -1.005684
C  -3.294952 0.0385 0.359318
C  -5.258745 -0.068376 -0.938977
C  -4.759932 -0.106189 0.400824
C  -1.536171 0.339882 -1.335308
C  -2.333086 0.084345 1.394184
C  -6.63619 -0.187367 -1.191016
C  -5.645854 -0.26332 1.490928
C  -0.555127 0.34947 -0.29977
C  -0.9716 0.235206 1.064019
C  -7.524262 -0.345465 -0.096501
C  -7.030903 -0.382715 1.232042
C  4.291424 -0.367096 0.340398
C  3.193443 0.273178 -0.364651
C  5.652199 -0.035798 -0.047898
C  1.787201 -0.000608 -0.018933
C  3.474007 1.186174 -1.401954
C  4.112847 -1.316577 1.403638
C  5.881251 0.899666 -1.108253
C  6.754821 -0.652107 0.633094
C  4.808092 1.498897 -1.775351
C  5.206252 -1.90142 2.047731
C  6.542249 -1.567877 1.663078
H  -4.039755 -0.732916 -2.637609
H  -4.212541 1.030494 -2.524228
H  -1.197616 0.459575 -2.369542
H  -2.63665 0.016369 2.444988
H  -7.024533 -0.158999 -2.215743
H  -5.272202 -0.293204 2.520767
H  -0.223903 0.30919 1.862298
H  -8.600929 -0.439507 -0.277393
H  -7.731989 -0.50517 2.065354
H  1.592938 -0.695365 0.820315
H  2.623181 1.649217 -1.91165
H  3.105903 -1.601032 1.723092
H  6.914435 1.138072 -1.388058
H  7.773868 -0.38829 0.325631
H  4.991016 2.212554 -2.585723
H  5.040249 -2.623712 2.854663
H  7.39005 -2.033353 2.177015
