program: Gaussian 09
title: 000225640
version: EM64L-G09RevD.01
frameworkgroup: C1[X(C22H20N2O)]
method: RPBEPBE
basis: SDD
operation: Freq
keyword: #p
keyword: freq=noraman
keyword: PBEPBE/SDD
title: #p freq=noraman PBEPBE/SDD
converged: YES YES NO NO
title: Mulliken charges:
elementType: O N N C C C C C C C C C C C C C C C C C C C C C C H H H H H H H H H H H H H H H H H H H H
charge: -0.433995 -0.082570 -0.149666 -0.332559 0.220249 0.201553 0.183453 0.181281 -0.559606 -0.393448 -0.402173 -0.396674 0.254670 -0.365712 -0.237118 -0.231299 -0.406999 0.468613 0.409762 -0.397011 -0.405336 -0.362730 -0.337138 -0.646425 -0.645926 0.249885 0.279346 0.236419 0.257485 0.238426 0.241276 0.226590 0.224730 0.337883 0.215792 0.222283 0.271380 0.237562 0.238214 0.238761 0.238944 0.218162 0.237787 0.218890 0.236989
chargesum: 0.00000
title: Mulliken charges with hydrogens summed into heavy atoms:
elementType: O N N C C C C C C C C C C C C C C C C C C C C C C
charge: -0.096111 -0.082570 -0.149666 -0.082673 0.220249 0.201553 0.183453 0.181281 -0.280261 -0.157030 -0.144688 -0.158248 0.254670 -0.124435 -0.010527 -0.006569 -0.191207 0.468613 0.409762 -0.174728 -0.133956 -0.125169 -0.098924 0.049442 0.047739
polarizability: 6.97789275e+02 1.05893666e+01 2.29597018e+02 3.33415087e+00 -1.03174043e+01 1.32704004e+02
1716.lowfreq: -7.3798 -3.1225 -2.5325 -0.0008 0.0005 0.0016 19.8066 24.7537 31.4545
frequency: 19.6828 24.7277 31.4526 58.0602 74.6895 85.3382 111.3715 115.1811 129.8366 130.0538 157.5164 178.9289 190.5955 196.7777 209.4542 251.4527 253.5532 299.4836 339.4688 351.4871 360.6997 374.7945 387.6745 426.7175 435.0077 441.5143 450.4641 468.2423 489.9076 521.4450 529.6597 533.2658 554.2820 583.5871 611.6850 617.3881 632.8123 671.1482 711.0654 719.6580 735.0991 741.8892 750.1799 769.0744 796.5222 806.0802 822.3569 827.4554 830.3708 857.6678 879.9181 911.3633 928.9364 939.7625 940.5016 949.5772 949.8383 969.3900 976.7072 985.1452 988.0866 994.2355 995.5389 1024.2334 1056.1838 1094.8079 1105.3332 1105.5090 1110.3190 1127.2712 1141.2311 1164.5191 1166.2112 1182.4057 1187.3542 1195.5018 1202.1363 1206.2600 1238.2381 1257.5910 1264.7835 1281.0811 1298.4708 1316.3313 1347.5649 1355.8233 1361.7515 1367.8474 1387.9519 1391.7831 1429.3923 1442.4478 1448.1935 1450.0035 1455.3201 1459.3073 1464.2511 1475.8773 1483.1760 1492.2879 1505.7564 1532.1390 1549.0192 1570.8151 1583.0782 1593.2738 1617.6690 1629.3191 1633.7871 2934.3665 2944.9638 2952.7430 3012.4833 3016.7988 3025.0098 3098.6992 3108.6660 3114.0198 3121.5735 3123.0440 3132.8553 3144.1952 3145.2533 3145.8194 3159.4718 3161.4118 3164.8674 3169.0028 3547.5098
redmass: 5.3351 4.0439 4.3515 4.9806 2.4222 4.5944 1.8847 3.6987 3.2861 4.4647 2.9674 4.1534 1.9034 1.7671 4.3479 3.7141 2.6078 4.0833 3.7559 1.3341 4.1499 3.8872 3.9840 3.0368 3.7908 4.0127 3.7577 3.8151 4.2628 2.8076 4.5909 3.7206 4.0223 4.1374 4.4178 6.3306 7.0816 4.5074 4.6291 5.0441 3.5114 3.5288 2.0380 2.6623 3.3604 1.3293 2.3299 2.2848 1.7293 3.3714 1.4727 1.8647 2.5699 2.8551 1.4063 1.3812 1.4353 4.3560 1.5588 1.3251 1.4779 3.8055 3.7609 2.0977 1.5032 2.0994 1.7002 1.3579 1.3251 1.4829 1.4658 1.6822 1.1927 1.5711 1.3580 1.6172 1.5089 1.6322 2.1341 2.8986 1.7551 1.5470 1.8193 1.6146 2.8823 1.2045 2.6420 4.0218 4.4250 2.7573 1.2581 2.5519 2.5992 3.5634 2.7765 1.3498 1.0405 1.0460 4.1833 1.1061 1.1312 2.8204 7.1016 7.2008 6.1098 6.7592 7.2854 7.3334 6.4306 1.0854 1.0368 1.0391 1.1000 1.1023 1.0835 1.0965 1.0944 1.0894 1.0862 1.0861 1.0893 1.0953 1.0958 1.0875 1.0927 1.1002 1.0933 1.0954 1.0662
irintensity: 1.4389 0.4248 0.5792 0.2047 0.0859 0.9312 3.3604 1.4121 0.1911 0.2570 1.6353 1.1175 2.0325 2.6463 0.2612 1.7571 2.5720 5.9804 22.0901 115.1587 1.7073 0.6696 2.6437 0.4968 1.9679 6.5634 6.1259 11.5843 4.7532 16.3325 3.1349 14.9210 0.9483 3.1608 10.9730 16.0871 0.7516 5.6855 4.0463 0.8013 24.7141 5.0984 46.1197 63.8471 8.0969 14.2805 11.9919 36.5015 61.6976 16.1039 3.8966 25.9985 6.4546 42.6070 2.5444 0.8683 1.7219 40.1400 34.6698 0.0178 17.8706 2.8622 3.9177 6.3133 26.1611 13.1934 22.7859 8.0922 0.9611 7.2097 7.4052 8.1029 4.5999 24.6638 265.1241 7.7088 19.5500 5.4663 37.0794 26.1952 4.7044 8.8116 17.5802 10.9568 5.7379 50.6365 93.8081 266.1127 1.4751 7.3994 17.5108 53.5427 14.5160 73.1292 19.9337 36.5791 0.1200 22.9197 7.2239 7.7140 65.6861 488.9796 191.5884 80.1984 580.2125 0.5982 1.7716 79.6461 311.4251 51.0624 106.3546 186.2291 17.1732 64.7725 9.9561 4.2160 53.7908 10.4925 18.0258 3.1197 1.9575 3.0910 40.0261 3.9986 4.5930 51.8929 23.6454 22.5312 7.8482
temp: 298.150 k
press: 1.00000 atm
elementType: 8 7 7 6 6 6 6 6 6 6 6 6 6 6 6 6 6 6 6 6 6 6 6 6 6 1 1 1 1 1 1 1 1 1 1 1 1 1 1 1 1 1 1 1 1
symmnumber: 1
zpe: 945362.0 jmol-1
zpe.correction: 0.360069 hartree
zpe.thermalcorrener: 0.382005 hartree
zpe.thermalcorrenthalpy: 0.382949 hartree
zpe.thermalcorrgfe: 0.307495 hartree
zpe.sumelectzpe: -1033.317911 hartree
zpe.sumelectthermal: -1033.295975 hartree
zpe.sumelectthermalent: -1033.295031 hartree
zpe.sumelectthermalfe: -1033.370486 hartree
dipole: 6.1322 -2.3600 0.5361
dipole: 6.5925
quadrupole: -80.4975 -140.4493 -148.6752
quadrupole: 8.8552 -0.5067 -5.7079
quadrupole: 42.7098 -17.2419 -25.4679 8.8552 -0.5067 -5.7079
hfenergy: -1033.6779808 hartree
pointgroup: C01 [X(C22H20N2O1)]
dipole: -2.3932597 -0.5382098 -0.842486 debye
polarizability: 697.9544402|-6.167411|171.8738362|3.6559367|48.5332737|190.2620207 unknown
InChI: InChI=1S/C22H20N2O/c1-24(2)17-10-7-15(8-11-17)14-23-16-9-12-19-18-5-3-4-6-20(18)22(25)21(19)13-16/h3-14,22,25H,1-2H3
charge 0 multiplicity 1
45 atoms
O  3.78325 2.759342 1.018719
N  -0.950046 0.004584 0.281847
N  -7.499591 0.147786 0.093121
C  3.860456 1.298772 1.224959
C  2.714582 0.499225 0.597106
C  5.099065 0.633457 0.617435
C  3.237988 -0.545803 -0.22514
C  4.713728 -0.463597 -0.211155
C  1.338209 0.674302 0.76299
C  2.355948 -1.433749 -0.876315
C  6.450148 0.96903 0.792035
C  5.6956 -1.240874 -0.862882
C  0.435544 -0.192892 0.074125
C  0.963511 -1.254079 -0.72683
C  7.437237 0.192925 0.129439
C  7.059717 -0.90334 -0.685255
C  -1.827239 -0.212011 -0.67543
C  -3.269649 -0.115292 -0.463915
C  -6.119555 0.061814 -0.091344
C  -4.169237 -0.327227 -1.546147
C  -3.826308 0.189688 0.812833
C  -5.559149 -0.243471 -1.375626
C  -5.209846 0.277484 1.000833
C  -8.052064 0.452962 1.420661
C  -8.409322 -0.067698 -1.040383
H  3.855793 1.213506 2.327272
H  0.927843 1.466308 1.396795
H  2.736784 -2.26132 -1.485798
H  6.735243 1.819313 1.421304
H  5.416075 -2.089276 -1.497768
H  0.271055 -1.958362 -1.202424
H  8.497885 0.440489 0.249339
H  7.834104 -1.49584 -1.185881
H  3.755338 2.930715 0.042095
H  -1.50849 -0.457751 -1.712488
H  -3.765872 -0.561782 -2.540052
H  -3.136422 0.35622 1.646861
H  -6.211292 -0.413777 -2.236451
H  -5.59444 0.515921 1.996304
H  -7.716759 1.443429 1.788719
H  -7.75962 -0.308385 2.171392
H  -9.151668 0.46761 1.364456
H  -8.234886 0.667291 -1.851862
H  -9.450765 0.044049 -0.700869
H  -8.29788 -1.084095 -1.469524
