program: Gaussian 09
title: 000225638
version: EM64L-G09RevD.01
frameworkgroup: C1[X(C22H18N2O)]
method: RPBEPBE
basis: SDD
operation: Freq
keyword: #p
keyword: freq=noraman
keyword: PBEPBE/SDD
title: #p freq=noraman PBEPBE/SDD
converged: YES YES NO NO
title: Mulliken charges:
elementType: O N N C C C C C C C C C C C C C C C C C C C C C C H H H H H H H H H H H H H H H H H H
charge: -0.252045 -0.078394 -0.437513 -0.694919 0.305116 0.180251 0.278297 0.179236 -0.579102 -0.394074 -0.422392 -0.394801 0.250365 -0.360130 -0.237931 -0.235723 -0.400519 0.469861 -0.380563 -0.369684 0.487411 -0.360749 -0.440676 0.214062 -0.799341 0.245586 0.245225 0.264796 0.237535 0.240641 0.237787 0.239749 0.224936 0.225024 0.220278 0.229436 0.276312 0.309796 0.218744 0.311290 0.237995 0.270646 0.238182
chargesum: 0.00000
title: Mulliken charges with hydrogens summed into heavy atoms:
elementType: O N N C C C C C C C C C C C C C C C C C C C C C C
charge: -0.252045 -0.078394 -0.126223 -0.204108 0.305116 0.180251 0.278297 0.179236 -0.314307 -0.156539 -0.181751 -0.157014 0.250365 -0.120381 -0.012995 -0.010699 -0.180241 0.469861 -0.151127 -0.093371 0.487411 -0.050953 -0.221932 0.214062 -0.052518
polarizability: 6.94725026e+02 9.94387878e-02 2.30454278e+02 -8.67457779e-01 -2.45102868e+00 1.18832737e+02
1716.lowfreq: -76.0868 -5.5365 -1.4001 -0.0012 0.0005 0.0015 0.4326 18.4067 25.1208
frequency: -76.0865 18.3832 25.0023 31.1134 53.9066 74.5668 87.2346 119.3684 130.7206 138.8219 142.0313 200.2445 219.9674 229.9888 242.4379 266.8050 326.4509 339.3285 343.2002 389.5879 416.6067 425.5681 435.1633 436.9745 451.6356 504.3363 517.1799 521.4413 535.4109 550.4527 582.8652 598.5549 603.1472 629.3309 642.0556 648.9769 664.8870 709.2695 726.4426 739.8266 745.9682 758.9740 777.6855 805.8378 821.0299 829.2463 841.8024 860.5319 862.4871 868.3983 892.6264 923.5607 930.1637 937.5194 950.8032 966.3683 969.7057 984.7507 985.1104 986.9299 994.1899 997.6952 1005.4516 1024.5393 1031.2062 1093.3892 1110.4332 1121.4777 1130.5486 1143.4360 1168.0309 1179.8918 1186.4857 1200.0721 1203.1508 1219.0783 1239.1830 1257.3320 1266.3828 1290.3320 1304.2564 1311.1053 1343.2863 1364.1081 1377.0175 1387.6048 1388.5486 1422.9340 1425.5245 1444.1308 1447.9763 1448.3324 1461.0550 1468.3424 1485.5760 1492.8670 1511.7775 1567.4347 1573.8662 1589.6216 1590.7238 1620.2541 1623.3350 1631.7721 1636.7475 2947.3951 2982.6522 2987.6406 3026.9540 3072.4432 3110.3918 3120.8735 3123.9886 3125.2852 3128.3812 3136.9698 3141.8957 3146.1403 3150.1887 3161.0103 3162.9145 3197.5763 3517.9907
redmass: 1.0512 6.2253 4.6920 4.8247 5.3314 4.6505 5.0756 4.8470 5.2725 5.1042 4.6411 4.7719 3.9188 3.4417 2.4446 5.4985 4.3812 5.6100 4.1789 4.0949 2.9506 2.9136 5.3592 2.8742 5.0440 3.2829 4.1096 4.4907 2.9945 5.2850 2.9423 4.9097 3.4726 6.8193 6.3155 1.1857 5.6028 2.9479 5.2147 2.0989 2.4324 5.5768 2.1511 3.6182 4.7748 1.7715 1.3784 1.4857 3.0705 1.4490 1.5321 3.5617 5.8609 1.5170 1.4005 1.5340 1.7861 1.3351 1.6931 1.4666 4.3058 1.5111 2.5625 2.1205 1.6623 2.1672 1.7196 1.4426 1.1546 1.4632 1.1417 1.1715 1.6127 1.8315 2.6177 3.3573 1.9155 1.8838 1.9433 1.5752 1.7563 1.8747 2.5237 4.9154 1.2362 2.6446 3.3536 3.9607 1.1697 2.8195 2.2568 1.4171 2.8298 1.0469 3.6677 1.9955 3.1255 6.6782 5.4776 6.3881 5.9563 7.2866 5.8799 7.3884 5.3934 1.0859 1.0608 1.0385 1.0993 1.0983 1.0898 1.0854 1.0871 1.0907 1.0892 1.0979 1.0946 1.0954 1.0935 1.1003 1.0945 1.0945 1.0764
irintensity: 0.0210 0.1369 2.0042 2.2580 0.1606 9.2196 0.8022 3.0036 1.6717 0.0676 3.1898 0.2170 4.5116 14.1423 6.0783 6.4060 7.4091 4.6470 2.7147 2.3609 1.0145 9.2483 0.9327 2.1884 4.1306 8.4346 5.3367 3.2421 22.7276 3.2621 1.1085 3.2163 5.0860 0.7121 11.0545 62.3420 16.9043 0.4625 1.9432 28.6476 39.2793 2.2570 47.6463 13.4021 0.6445 18.3102 28.8658 43.9079 11.7480 1.8449 17.3550 5.1616 15.5123 4.2014 0.5541 33.0947 7.2470 0.3646 51.9999 7.3264 3.6232 3.8274 5.7838 6.9085 8.1647 6.8997 29.7835 9.1795 0.2834 2.6240 2.6360 92.3220 1.3252 7.9397 0.5558 115.7331 10.0208 44.3723 41.5887 0.6707 46.3438 126.2245 103.4494 13.6059 56.3955 130.1561 13.7079 26.9029 20.8039 33.6980 17.5122 81.0076 17.3565 20.4300 8.5135 409.4090 459.8610 16.4205 9.7143 52.9881 112.0683 0.7554 97.9637 6.6747 131.3534 53.5244 14.0613 9.0985 7.7829 14.7419 33.5460 7.3281 14.4853 9.2780 1.2975 8.5483 26.5597 23.5230 1.7923 56.4851 4.0623 3.3328 13.8227
temp: 298.150 k
press: 1.00000 atm
elementType: 8 7 7 6 6 6 6 6 6 6 6 6 6 6 6 6 6 6 6 6 6 6 6 6 6 1 1 1 1 1 1 1 1 1 1 1 1 1 1 1 1 1 1
symmnumber: 1
zpe: 887868.3 jmol-1
zpe.correction: 0.338171 hartree
zpe.thermalcorrener: 0.358303 hartree
zpe.thermalcorrenthalpy: 0.359247 hartree
zpe.thermalcorrgfe: 0.287306 hartree
zpe.sumelectzpe: -1032.189049 hartree
zpe.sumelectthermal: -1032.168917 hartree
zpe.sumelectthermalent: -1032.167973 hartree
zpe.sumelectthermalfe: -1032.239914 hartree
dipole: 1.3126 2.9086 -0.9653
dipole: 3.3339
quadrupole: -115.7454 -130.9511 -151.6361
quadrupole: 24.9734 -12.6944 1.3341
quadrupole: 17.0321 1.8264 -18.8585 24.9734 -12.6944 1.3341
hfenergy: -1032.5272202 hartree
pointgroup: C01 [X(C22H18N2O1)]
dipole: 0.5308599 -0.3685542 1.1413914 debye
polarizability: 694.5593791|8.9027925|156.2810088|-2.2608197|-52.7554778|193.1716524 unknown
InChI: InChI=1S/C22H18N2O/c1-15(25)24-19-8-6-16(7-9-19)14-23-20-10-11-22-18(13-20)12-17-4-2-3-5-21(17)22/h2-11,13-14,24H,12H2,1H3
charge 0 multiplicity 1
43 atoms
O  7.942713 0.388506 -1.504094
N  0.381437 -0.067254 0.364585
N  6.90962 -0.101422 0.54889
C  -4.416424 -1.472935 1.205156
C  -3.275345 -0.665803 0.595353
C  -3.801498 0.328471 -0.288691
C  -5.655247 -0.837249 0.582644
C  -5.270671 0.223992 -0.295325
C  -1.896146 -0.779948 0.805721
C  -2.926582 1.213464 -0.958969
C  -7.011739 -1.156319 0.764585
C  -6.250122 0.96714 -0.992686
C  -1.00436 0.084358 0.104896
C  -1.536697 1.088185 -0.764083
C  -7.993774 -0.410219 0.064138
C  -7.613621 0.64199 -0.806545
C  1.286969 0.174736 -0.555309
C  2.725832 0.10291 -0.274055
C  3.667288 0.347731 -1.310217
C  3.216119 -0.20895 1.026763
C  5.529369 -0.021721 0.221549
C  5.054776 0.290376 -1.081647
C  4.593976 -0.270768 1.269829
C  8.024639 0.096318 -0.276868
C  9.3602 -0.079255 0.446422
H  -4.42644 -1.402528 2.310626
H  -4.336769 -2.549973 0.958526
H  -1.468836 -1.521079 1.488954
H  -3.318058 1.998293 -1.616069
H  -7.312821 -1.968721 1.436239
H  -5.964191 1.782083 -1.667348
H  -0.853429 1.792249 -1.252887
H  -9.05539 -0.647738 0.195809
H  -8.386059 1.207987 -1.33941
H  1.012936 0.421887 -1.603382
H  3.305018 0.587752 -2.317898
H  2.488774 -0.397222 1.822567
H  5.77254 0.479548 -1.881036
H  4.959141 -0.512588 2.276937
H  7.112319 -0.334782 1.524489
H  9.46549 0.641363 1.278694
H  10.172564 0.092931 -0.273724
H  9.463399 -1.099699 0.860065
