program: Gaussian 09
title: 000018548
version: EM64L-G09RevD.01
frameworkgroup: C1[X(C13H15NO)]
method: RPBEPBE
basis: SDD
operation: Freq
keyword: #p
keyword: freq=noraman
keyword: PBEPBE/SDD
title: #p freq=noraman PBEPBE/SDD
converged: YES YES NO NO
title: Mulliken charges:
elementType: O N C C C C C C C C C C C C C H H H H H H H H H H H H H H H
charge: -0.239788 -0.326826 -0.185354 -0.628259 0.422895 0.498138 -0.433764 -0.388418 -0.425660 -0.638132 -0.263327 -0.184803 -0.231578 -0.228801 -0.244200 0.223680 0.192632 0.257471 0.257648 0.258710 0.246110 0.227297 0.188389 0.219604 0.248137 0.250143 0.255775 0.223976 0.222170 0.226134
chargesum: 0.00000
title: Mulliken charges with hydrogens summed into heavy atoms:
elementType: O N C C C C C C C C C C C C C
charge: -0.239788 -0.069178 0.038326 -0.178156 0.422895 0.498138 -0.175054 -0.142308 -0.198363 0.017999 -0.013184 0.070972 -0.007603 -0.006631 -0.018066
polarizability: 1.52972638e+02 3.16516535e+00 1.56050517e+02 1.64397644e+01 -5.68126363e+00 1.09534915e+02
1716.lowfreq: -9.0408 0.0001 0.0005 0.0008 1.9533 6.9745 30.0785 43.4828 49.2782
frequency: 29.8845 43.1242 49.2569 59.0277 93.2922 127.2522 167.6004 191.3804 228.2875 256.0732 307.8533 346.8724 405.4957 429.5277 438.1266 532.6568 573.7730 591.2499 596.3027 617.9727 656.6819 705.6346 719.1030 725.2953 764.4181 814.3470 818.4210 855.4778 868.3576 874.3520 879.5860 917.0044 924.4209 973.5426 978.2319 990.4263 994.5654 1005.2984 1018.8099 1028.3300 1046.7812 1080.9769 1104.1983 1128.5090 1132.7419 1149.0071 1170.6491 1174.8165 1188.1375 1208.7000 1217.8205 1228.8814 1282.5872 1309.2355 1323.0917 1331.0766 1369.3320 1382.8300 1434.6206 1439.7473 1447.8791 1464.4296 1470.9110 1484.6184 1489.3903 1496.0356 1589.3458 1593.2917 1615.0171 2842.1717 2871.9272 2982.3692 3025.2886 3063.5172 3081.8166 3110.6888 3121.3636 3132.9942 3143.9948 3161.2680 3215.5206 3230.5746 3264.3141 3464.1587
redmass: 4.2002 4.0516 4.4095 3.4810 3.1647 2.8083 1.8044 3.7508 1.8075 4.6580 3.8821 2.3465 2.8330 2.9011 3.6749 2.8550 2.7285 2.5385 2.7548 6.2938 3.5449 2.0867 2.1334 1.3406 2.0345 2.9927 1.4580 1.2493 6.3478 1.3773 4.4604 1.5303 1.7505 2.2320 1.4276 5.8379 1.3472 1.8767 2.3824 2.1531 2.6077 1.6532 1.3417 1.4561 1.5973 4.0319 1.1176 1.4323 1.1213 1.4101 2.2215 3.1973 1.3181 1.3943 1.4497 1.3202 2.1197 7.8048 1.1830 1.9949 1.3828 1.0705 1.1223 2.2835 2.0682 1.3829 6.2507 6.0033 6.1583 1.0809 1.0567 1.0642 1.0737 1.0978 1.1005 1.0871 1.0858 1.0914 1.0961 1.1015 1.0921 1.0984 1.1084 1.0747
irintensity: 0.0634 0.0557 0.5566 0.7707 2.9268 0.9268 2.4093 1.5317 3.6979 2.0493 2.6672 1.5465 0.1042 16.3785 5.2445 48.2099 48.6147 15.1369 4.0389 0.2079 12.5532 52.5106 9.9819 87.1817 40.5367 3.2644 36.1386 0.0874 6.6088 0.5292 10.1137 9.1989 4.9936 4.1051 0.3497 0.0526 0.2692 19.7827 5.2167 10.3454 0.9532 11.5548 3.7648 9.7521 18.3897 43.5669 2.4239 8.5227 0.8361 2.4736 0.9515 7.8110 1.4714 5.2803 14.2516 7.0671 7.8071 0.1714 10.8560 4.4313 20.1655 5.9782 9.2797 16.3314 9.1201 13.9586 1.6248 0.9274 6.7143 66.6617 139.9966 44.2744 41.4792 11.1148 35.6915 10.0412 0.8336 16.2161 44.0769 22.1410 4.4604 0.4163 1.0680 2.2686
temp: 298.150 k
press: 1.00000 atm
elementType: 8 7 6 6 6 6 6 6 6 6 6 6 6 6 6 1 1 1 1 1 1 1 1 1 1 1 1 1 1 1
symmnumber: 1
zpe: 649954.7 jmol-1
zpe.correction: 0.247555 hartree
zpe.thermalcorrener: 0.261522 hartree
zpe.thermalcorrenthalpy: 0.262466 hartree
zpe.thermalcorrgfe: 0.204962 hartree
zpe.sumelectzpe: -633.219895 hartree
zpe.sumelectthermal: -633.205928 hartree
zpe.sumelectthermalent: -633.204983 hartree
zpe.sumelectthermalfe: -633.262487 hartree
dipole: 0.0440 -0.4355 1.4656
dipole: 1.5295
quadrupole: -88.8148 -75.3290 -89.7516
quadrupole: 0.2880 0.3017 -2.5188
quadrupole: -4.1830 9.3028 -5.1198 0.2880 0.3017 -2.5188
hfenergy: -633.4674495 hartree
pointgroup: C01 [X(C13H15N1O1)]
dipole: -0.0184844 -0.1390132 -0.5852022 debye
polarizability: 152.5207808|-4.0162423|155.5552025|16.742343|7.6235688|110.482087 unknown
InChI: InChI=1S/C13H15NO/c1-14-12(13-8-5-9-15-13)10-11-6-3-2-4-7-11/h2-9,12,14H,10H2,1H3
charge 0 multiplicity 1
30 atoms
O  1.882025 0.880757 1.006072
N  2.178425 -2.052087 0.257459
C  1.057401 -1.174987 -0.152301
C  -0.127696 -1.397699 0.844977
C  1.483721 0.268083 -0.206334
C  -1.410385 -0.698306 0.426293
C  1.549099 1.202057 -1.226581
C  -1.663641 0.646183 0.802722
C  -2.37185 -1.367911 -0.374212
C  3.346517 -2.071575 -0.639006
C  2.007839 2.45062 -0.649581
C  2.197771 2.21699 0.700848
C  -2.844106 1.303492 0.389937
C  -3.554623 -0.714822 -0.789772
C  -3.794571 0.625658 -0.408561
H  0.688316 -1.412236 -1.183956
H  -0.305814 -2.490067 0.91113
H  0.211743 -1.056514 1.838955
H  1.845528 -2.993144 0.499897
H  1.292216 1.021022 -2.268607
H  -0.93006 1.177844 1.42052
H  -2.196263 -2.41148 -0.666361
H  3.110497 -2.349432 -1.696068
H  4.092011 -2.787946 -0.250913
H  3.819231 -1.073655 -0.656197
H  2.172564 3.3918 -1.170543
H  2.535267 2.823066 1.537105
H  -3.02326 2.341789 0.691909
H  -4.288482 -1.250031 -1.403433
H  -4.71212 1.133832 -0.726298
