program: Gaussian 09
title: 000225719
version: EM64L-G09RevD.01
frameworkgroup: C1[X(C21H32N4)]
method: RPBEPBE
basis: SDD
operation: Freq
keyword: #pfreq=noraman
keyword: PBEPBE/SDD
title: #p freq=noraman PBEPBE/SDD
converged: YES YES NO NO
title: Mulliken charges:
elementType: N N N N C C C C C C C C C C C C C C C C C C C C C H H H H H H H H H H H H H H H H H H H H H H H H H H H H H H H H
charge: -0.104825 -0.365015 -0.080345 -0.078569 -0.436618 -0.371091 -0.004224 -0.354495 -0.321951 -0.322784 -0.713602 -0.059511 -0.673757 -0.678093 0.087158 0.089386 0.088177 0.301846 -0.771206 -0.774992 -0.403108 -0.399217 -0.227960 -0.228131 -0.245520 0.199617 0.187385 0.206530 0.216769 0.238608 0.197197 0.179137 0.183350 0.202556 0.207396 0.183634 0.208838 0.244880 0.201505 0.306139 0.204619 0.228754 0.207718 0.205048 0.229653 0.206113 0.239164 0.234743 0.246626 0.237503 0.247537 0.234879 0.241075 0.239591 0.226561 0.226475 0.228847
chargesum: 0.00000
title: Mulliken charges with hydrogens summed into heavy atoms:
elementType: N N N N C C C C C C C C C C C C C C C C C C C C C
charge: -0.104825 -0.058876 -0.080345 -0.078569 -0.049616 0.052208 0.234383 0.021840 0.063956 0.068246 -0.058379 -0.059511 -0.032665 -0.037279 0.087158 0.089386 0.088177 0.301846 -0.050673 -0.055074 -0.162034 -0.159626 -0.001398 -0.001655 -0.016673
polarizability: 3.58804190e+02 -4.07198358e+01 2.48675790e+02 -1.96946238e+01 -9.66286284e+00 2.00399588e+02
1716.lowfreq: -10.5439 -6.4796 -3.4746 -0.0008 0.0004 0.0009 2.4081 9.3791 15.2710
frequency: -8.5165 9.3087 15.1292 28.2322 33.3886 51.1182 56.3763 64.3703 77.8869 90.0161 95.2929 107.3617 109.9350 123.0501 129.1630 146.1004 176.2631 190.4629 204.7335 215.6130 219.9140 232.3655 243.9868 257.0941 265.8817 289.7392 299.8658 313.2601 346.2665 363.0081 403.3174 418.6281 422.3455 437.1238 450.6344 485.7648 504.6118 512.2808 540.8542 541.8680 550.8130 553.7090 573.4611 613.0874 664.4720 670.3672 706.5939 723.8131 740.1725 744.5385 768.4716 788.5985 793.4549 794.4218 834.7224 854.8358 865.5303 905.8492 917.2285 919.9653 939.1617 958.0923 976.4133 981.0418 982.5901 991.3299 993.9070 1000.1971 1024.0142 1032.1535 1036.8280 1038.2403 1042.3596 1054.4606 1073.2932 1078.0351 1078.2165 1081.1737 1084.3017 1092.9900 1107.6704 1137.7792 1146.4354 1171.2011 1179.8785 1186.6303 1202.9614 1212.1233 1237.1313 1255.3598 1257.1516 1277.6282 1278.6843 1287.1775 1290.7771 1306.9127 1308.3031 1319.4017 1345.5109 1357.8380 1359.2205 1362.3399 1366.5130 1372.4173 1376.1320 1378.8140 1385.2438 1386.4568 1390.8871 1392.9368 1414.7206 1430.8614 1448.1083 1455.7583 1458.9467 1460.5417 1463.3883 1463.7735 1464.5346 1468.2520 1470.5168 1473.3829 1477.7074 1478.4697 1484.7073 1485.3033 1487.6849 1489.9802 1500.3938 1529.0222 1557.1362 1580.6955 1609.7463 2832.0530 2840.5781 2855.0085 2946.0564 2976.6025 2981.3618 2982.0056 2988.2144 2988.4499 2989.7121 3009.6631 3019.9806 3026.0989 3029.8868 3032.6853 3055.3281 3072.6557 3073.2316 3073.6203 3073.9036 3074.4795 3090.9669 3091.2730 3091.7341 3117.1021 3117.7493 3119.8067 3123.3888 3136.6776 3145.8504 3162.7449 3551.2302
redmass: 3.1995 4.6125 3.8311 3.2583 4.4798 3.2016 2.8135 3.7993 2.0736 2.5755 1.1611 1.2686 1.9274 2.5474 2.5672 3.4758 1.9011 2.4159 1.9054 1.8214 3.9540 1.1230 2.1092 2.3257 3.7018 1.9614 2.5614 2.6415 3.1604 2.7585 2.8364 2.9913 4.1823 3.4804 2.8193 3.0737 3.0881 2.6033 3.8761 3.6699 1.4108 4.3446 3.3947 6.2544 5.0204 4.8548 1.7196 2.7074 2.6135 1.3754 2.1711 6.1446 1.1351 1.1991 1.6082 1.2444 1.9324 2.8818 1.8828 1.4672 2.0116 2.9548 1.4006 2.1266 3.8179 4.8161 1.3127 1.5127 3.3074 1.9141 1.7358 1.7184 1.5596 2.5535 1.8888 1.6399 2.5056 2.1780 2.1631 2.0005 2.6769 1.7925 1.9842 1.0529 2.4396 1.1174 2.2526 2.1048 2.5157 1.6365 2.4611 1.3481 1.2479 1.2415 1.1556 1.6242 1.3897 1.8819 1.6374 1.4311 1.3359 1.3564 5.4359 3.3867 1.4071 1.2574 1.2332 1.2315 1.2405 1.4203 2.0888 2.1975 1.1759 1.1061 1.0599 1.0855 1.0601 1.1350 1.0996 1.0941 1.0592 1.0808 1.0473 1.0556 1.8621 1.2235 1.0876 1.0737 4.0021 3.4042 6.3329 5.9911 6.1703 1.0713 1.0723 1.0711 1.0645 1.0358 1.0358 1.0357 1.0401 1.0606 1.0392 1.0896 1.0858 1.0886 1.0870 1.0875 1.1021 1.0985 1.0938 1.0928 1.0992 1.0979 1.0998 1.1002 1.1002 1.1007 1.1003 1.0846 1.0876 1.0921 1.0966 1.1016 1.0763
irintensity: 0.1382 0.0253 0.0475 0.3288 0.5378 0.5900 0.0473 0.8578 0.1481 0.2123 0.2995 0.1314 0.3463 0.9010 0.6224 0.3034 2.1749 1.5402 1.4286 0.4286 0.8513 0.2776 0.5193 0.6530 0.9912 1.1601 1.7861 1.3756 1.9318 2.2705 0.0485 4.9653 0.8193 2.2462 5.6036 4.6055 5.2228 14.4365 5.3355 19.3717 96.9933 4.7339 8.2213 0.1844 13.9461 12.1576 49.2579 15.0519 6.2729 3.0697 28.8502 16.0370 5.6304 5.9935 0.0842 0.0153 3.3063 1.3611 0.9650 1.3915 9.5900 6.8644 0.4222 10.2028 7.5360 6.3998 0.1031 1.2963 1.5370 5.8862 5.2780 2.9258 0.1336 7.2282 15.6328 6.3194 24.9487 22.3903 5.9637 13.1804 10.4941 16.1918 66.6142 0.0101 11.9690 0.0772 25.7742 16.7650 9.1408 3.4748 20.7929 1.8943 9.4741 16.3184 22.0569 19.8687 2.5875 9.5313 4.2279 23.3989 2.8199 8.9791 1.5170 34.7242 2.5764 18.5928 22.5022 19.9721 32.9277 41.2266 31.5098 4.0814 32.9271 21.7480 3.2451 5.0163 7.2780 33.3850 23.7312 60.2331 1.5106 11.7800 9.5470 6.7000 37.3263 5.7751 21.4158 13.6422 149.8089 197.6678 1025.4603 3.8861 8.2361 45.1413 33.4685 252.1263 37.3783 38.2596 36.8342 27.6723 13.4655 21.6751 10.4258 21.1638 11.0573 6.5988 10.5932 22.1144 55.7899 23.0340 19.0786 6.8708 87.5682 80.0631 31.1117 32.6347 55.4717 11.5997 19.7282 4.3389 0.0463 14.9352 40.6229 28.6526 53.4891
temp: 298.150 k
press: 1.00000 atm
elementType: 7 7 7 7 6 6 6 6 6 6 6 6 6 6 6 6 6 6 6 6 6 6 6 6 6 1 1 1 1 1 1 1 1 1 1 1 1 1 1 1 1 1 1 1 1 1 1 1 1 1 1 1 1 1 1 1 1
symmnumber: 1
zpe: 1288717.6 jmol-1
zpe.correction: 0.490847 hartree
zpe.thermalcorrener: 0.517868 hartree
zpe.thermalcorrenthalpy: 0.518812 hartree
zpe.thermalcorrgfe: 0.430039 hartree
zpe.sumelectzpe: -1036.536579 hartree
zpe.sumelectthermal: -1036.509557 hartree
zpe.sumelectthermalent: -1036.508613 hartree
zpe.sumelectthermalfe: -1036.597387 hartree
dipole: -0.3407 0.0981 0.3637
dipole: 0.5079
quadrupole: -131.5243 -145.8669 -155.3740
quadrupole: -4.0568 -6.1577 -0.8624
quadrupole: 12.7307 -1.6118 -11.1189 -4.0568 -6.1577 -0.8624
hfenergy: -1037.0274257 hartree
pointgroup: C01 [X(C21H32N4)]
dipole: -0.1324644 -0.0210006 -0.1481425 debye
polarizability: 358.1323428|38.2228596|250.438272|26.2308196|-3.0455464|199.3089529 unknown
InChI: InChI=1S/C21H32N4/c1-6-25(7-2)15-11-12-16(3)22-21-23-17(4)20(18(5)24-21)19-13-9-8-10-14-19/h8-10,13-14,16,22H,6-7,11-12,15H2,1-5H3
charge 0 multiplicity 1
57 atoms
N  -5.675075 0.967902 0.25959
N  -0.986426 -1.305286 -1.219067
N  0.808264 -1.42385 0.308905
N  0.894182 -0.001135 -1.681143
C  -3.306117 -1.973626 -0.696524
C  -3.750348 -0.63248 -0.071652
C  -1.806128 -2.293345 -0.489095
C  -5.245418 -0.334705 -0.314276
C  -7.113091 0.985702 0.641348
C  -5.297235 2.119946 -0.604029
C  -1.452302 -3.737595 -0.920129
C  0.27531 -0.907058 -0.845746
C  -7.396133 0.214621 1.945058
C  -5.154887 3.439381 0.17924
C  2.77515 -0.033444 -0.119048
C  2.050838 -0.982218 0.668224
C  2.134028 0.429335 -1.316019
C  4.133289 0.448368 0.278678
C  2.598806 -1.559889 1.956152
C  2.793397 1.410371 -2.262178
C  4.34868 1.807593 0.636299
C  5.244544 -0.437928 0.308792
C  5.630771 2.265859 1.012661
C  6.528161 0.017825 0.683202
C  6.727206 1.372672 1.037125
H  -3.89555 -2.802177 -0.255756
H  -3.532965 -1.981711 -1.785647
H  -3.126211 0.187438 -0.476921
H  -3.570863 -0.646423 1.020382
H  -1.548071 -2.179541 0.58024
H  -5.842319 -1.136048 0.161063
H  -5.465115 -0.391331 -1.413085
H  -7.760837 0.588937 -0.182825
H  -7.40923 2.040217 0.788948
H  -4.323244 1.885914 -1.071561
H  -6.026483 2.2539 -1.444526
H  -2.023122 -4.473241 -0.323297
H  -0.376222 -3.925515 -0.76327
H  -1.686947 -3.901626 -1.988714
H  -1.317681 -0.932358 -2.110974
H  -8.469074 0.276677 2.207591
H  -6.801806 0.640783 2.771858
H  -7.135034 -0.855662 1.856663
H  -4.843919 4.25852 -0.496179
H  -4.396791 3.326189 0.973446
H  -6.104488 3.742877 0.656604
H  3.205494 -0.823529 2.509048
H  3.248848 -2.432002 1.751859
H  1.762042 -1.906314 2.58292
H  3.8751 1.216871 -2.360622
H  2.307275 1.343861 -3.247959
H  2.681985 2.449097 -1.897929
H  3.500613 2.50249 0.631863
H  5.099579 -1.486767 0.024206
H  5.772929 3.316583 1.290158
H  7.371644 -0.681924 0.695153
H  7.722298 1.727199 1.328297
