program: Gaussian 09
title: 000225629
version: EM64L-G09RevD.01
frameworkgroup: C1[X(C18H13NS)]
method: RPBEPBE
basis: SDD
operation: Freq
keyword: #p
keyword: freq=noraman
keyword: PBEPBE/SDD
title: #p freq=noraman PBEPBE/SDD
converged: YES YES NO NO
title: Mulliken charges:
elementType: S N C C C C C C C C C C C C C C C C C C H H H H H H H H H H H H H
charge: 0.246201 -0.061763 -0.694015 0.304688 0.180692 0.278745 0.179399 -0.573263 -0.394642 -0.421482 -0.393667 0.249633 -0.351900 -0.237045 -0.235349 -0.251305 -0.084993 -0.288758 -0.126572 -0.512322 0.246006 0.246591 0.266490 0.238096 0.241285 0.238066 0.236992 0.225554 0.225608 0.222558 0.283952 0.248337 0.268182
chargesum: 0.00000
title: Mulliken charges with hydrogens summed into heavy atoms:
elementType: S N C C C C C C C C C C C C C C C C C C
charge: 0.246201 -0.061763 -0.201417 0.304688 0.180692 0.278745 0.179399 -0.306772 -0.156546 -0.180197 -0.155601 0.249633 -0.114908 -0.011491 -0.009741 -0.028747 -0.084993 -0.004806 0.121765 -0.244141
polarizability: 5.57625528e+02 -7.34486168e+00 2.00719833e+02 2.81357241e+00 -3.47982998e+00 9.39246295e+01
1716.lowfreq: -9.2059 -5.0415 -0.0019 -0.0004 0.0005 1.7103 25.3879 33.0091 45.8262
frequency: 25.3042 33.0070 45.8249 87.3577 131.8200 136.8641 149.7842 195.9070 226.7852 240.4745 249.4223 283.3472 360.7236 402.7462 421.8655 437.5488 440.4521 471.3104 510.2470 515.0482 543.9772 567.1556 571.3123 592.2767 605.7090 641.5963 688.7943 703.3771 709.5792 710.3918 741.5863 745.3012 777.7025 808.1633 822.1512 823.1276 839.9613 846.1964 868.0168 892.7235 921.5839 923.9595 937.9843 950.5586 956.5730 969.7755 985.3546 994.0308 1023.9302 1030.1342 1079.9062 1093.8941 1110.3715 1131.5961 1134.0852 1160.0711 1168.2705 1187.4779 1201.0129 1207.2571 1237.2187 1254.9787 1290.8821 1306.2097 1345.9786 1357.1164 1373.9276 1388.4772 1426.2354 1441.8204 1444.9412 1459.1133 1461.3252 1486.2273 1539.0675 1563.0658 1568.0165 1589.8438 1620.2173 1629.5210 2961.2503 2983.3531 3027.6953 3121.3216 3124.1300 3128.6192 3142.1422 3146.2266 3151.8245 3161.2947 3177.2167 3199.4455 3239.1069
redmass: 6.4473 5.1050 5.9827 5.5484 4.1783 4.3858 5.0842 8.2062 4.6565 2.4623 3.4097 3.9525 5.0783 7.6997 2.8252 2.8843 5.3347 4.3824 3.4763 4.2939 6.2741 7.4606 3.2643 6.3227 3.4148 6.3442 6.6747 1.1907 3.5212 4.2066 1.8352 4.1573 2.1128 3.4057 3.3900 3.6856 2.2159 1.3225 1.3836 1.4900 2.8584 1.5099 1.5076 1.3965 1.5887 1.8772 1.3369 6.5400 2.1083 1.7584 1.2975 1.9995 1.7457 1.1594 1.6815 1.6653 1.1466 1.6981 1.8712 2.3191 1.5898 1.9489 1.5809 1.9639 2.9854 2.8212 2.0952 4.4792 1.1679 3.1909 3.2639 4.1589 3.1975 3.8156 6.3145 6.1275 6.9464 6.6011 7.2971 7.5173 1.0860 1.0609 1.0993 1.0854 1.0870 1.0894 1.0947 1.0961 1.0931 1.1003 1.0900 1.0976 1.0998
irintensity: 0.4870 0.6099 0.2369 0.1595 1.4995 1.5539 0.9619 0.3034 5.8757 12.5440 13.8473 3.6447 3.5113 0.2039 9.8492 1.1583 8.9353 10.9307 1.0508 1.3763 0.4264 2.6738 4.5364 7.0700 2.0916 6.5933 0.8771 102.7439 8.1050 15.7485 50.9893 14.1139 55.3116 40.6083 4.8754 9.2697 10.6086 18.9895 0.0454 11.3579 6.8662 2.4446 4.2843 0.7891 17.3711 12.9885 0.3167 3.9755 10.8165 16.3702 2.2932 2.2990 5.9881 0.5896 12.0911 6.6745 2.6641 2.8184 9.3085 4.7518 29.7483 1.8312 0.7730 2.3871 12.0089 20.0583 3.1397 9.9838 21.6808 77.9257 12.8155 14.7771 20.1666 11.2895 7.1219 53.1432 3.5732 0.6277 2.1912 12.4799 38.7485 13.3475 7.4915 7.3103 11.3672 1.2129 24.9358 23.7113 1.8103 54.0166 12.9978 1.0661 0.5513
temp: 298.150 k
press: 1.00000 atm
elementType: 16 7 6 6 6 6 6 6 6 6 6 6 6 6 6 6 6 6 6 6 1 1 1 1 1 1 1 1 1 1 1 1 1
symmnumber: 1
zpe: 660222.5 jmol-1
zpe.correction: 0.251465 hartree
zpe.thermalcorrener: 0.267301 hartree
zpe.thermalcorrenthalpy: 0.268245 hartree
zpe.thermalcorrgfe: 0.206550 hartree
zpe.sumelectzpe: -1145.168868 hartree
zpe.sumelectthermal: -1145.153033 hartree
zpe.sumelectthermalent: -1145.152088 hartree
zpe.sumelectthermalfe: -1145.213783 hartree
dipole: -0.4402 0.1045 0.1899
dipole: 0.4907
quadrupole: -97.2594 -110.0332 -129.9912
quadrupole: 0.0451 1.5660 0.7473
quadrupole: 15.1685 2.3948 -17.5633 0.0451 1.5660 0.7473
hfenergy: -1145.4203331 hartree
pointgroup: C01 [X(C18H13N1S1)]
dipole: 0.1756217 -0.0614526 0.0514832 debye
polarizability: 557.1970204|14.6278586|175.5462405|2.2897959|45.7951169|119.5267293 unknown
InChI: InChI=1S/C18H13NS/c1-2-6-17-13(4-1)10-14-11-15(7-8-18(14)17)19-12-16-5-3-9-20-16/h1-9,11-12H,10H2
charge 0 multiplicity 1
33 atoms
S  5.777453 1.119552 1.271237
N  2.247519 -0.154975 -0.28174
C  -2.526001 -1.823094 -0.570471
C  -1.399141 -0.831532 -0.302499
C  -1.944209 0.417712 0.132633
C  -3.777247 -1.013297 -0.247044
C  -3.412121 0.306532 0.165174
C  -0.016558 -0.999554 -0.440705
C  -1.085182 1.502273 0.423995
C  -5.128803 -1.393707 -0.306091
C  -4.405819 1.247435 0.519109
C  0.859436 0.077681 -0.113482
C  0.307577 1.330369 0.303786
C  -6.125036 -0.449012 0.049569
C  -5.76411 0.859621 0.458453
C  3.145397 0.472144 0.447443
C  4.56477 0.285376 0.205726
C  5.211761 -0.481312 -0.767277
C  6.643303 -0.424022 -0.691618
C  7.113863 0.3863 0.336293
H  -2.441351 -2.725209 0.066805
H  -2.522151 -2.177227 -1.620054
H  0.427233 -1.938899 -0.785891
H  -1.492248 2.472926 0.728975
H  -5.415121 -2.403762 -0.621423
H  -4.134726 2.260888 0.835979
H  0.976343 2.178127 0.492484
H  -7.183082 -0.731137 0.00865
H  -6.54765 1.576203 0.729411
H  2.870432 1.143041 1.287487
H  4.646086 -1.056941 -1.502488
H  7.3080 -0.960483 -1.372832
H  8.141178 0.610383 0.617708
