program: Gaussian 09
title: 000225645
version: EM64L-G09RevD.01
frameworkgroup: C1[X(C26H27N3O)]
method: RPBEPBE
basis: SDD
operation: Freq
keyword: #p
keyword: freq=noraman
keyword: PBEPBE/SDD
title: #p freq=noraman PBEPBE/SDD
converged: YES YES NO NO
title: Mulliken charges:
elementType: O N N N C C C C C C C C C C C C C C C C C C C C C C C C C C H H H H H H H H H H H H H H H H H H H H H H H H H H H
charge: -0.248618 -0.094595 -0.083900 -0.149611 -0.398430 0.296844 0.272678 0.177125 0.159893 -0.335982 -0.325014 -0.325614 -0.319039 -0.565162 -0.442080 -0.392818 -0.406591 0.217863 -0.387801 -0.242459 -0.234822 -0.400219 0.467778 -0.397788 -0.408241 0.408580 -0.363027 -0.337801 -0.645989 -0.646544 0.243015 0.231321 0.209594 0.188792 0.205521 0.213831 0.191586 0.189553 0.210209 0.252021 0.262604 0.239573 0.239466 0.250699 0.224910 0.223869 0.216099 0.224258 0.270736 0.237798 0.237544 0.237195 0.237772 0.218537 0.238290 0.238551 0.218043
chargesum: 0.00000
title: Mulliken charges with hydrogens summed into heavy atoms:
elementType: O N N N C C C C C C C C C C C C C C C C C C C C C C C C C C
charge: -0.248618 -0.094595 -0.083900 -0.149611 -0.155415 0.296844 0.272678 0.177125 0.159893 0.104932 0.069299 0.079802 0.080724 -0.313141 -0.179476 -0.153246 -0.167125 0.217863 -0.137103 -0.017549 -0.010953 -0.184120 0.467778 -0.173530 -0.137505 0.408580 -0.125230 -0.100257 0.047515 0.048340
polarizability: 7.20288793e+02 -5.32739841e+01 3.03997873e+02 3.16086510e+00 -1.88824678e+01 1.73828926e+02
1716.lowfreq: -6.0906 -0.4833 -0.0009 -0.0005 0.0011 4.6878 17.6347 23.4619 26.0870
frequency: 17.5304 23.4434 26.0050 44.3626 49.1843 65.4576 66.7049 74.6822 90.9383 116.6092 123.0422 134.8144 149.2722 167.9262 183.5410 204.2087 214.5903 218.0135 238.6215 251.1131 258.2912 283.0187 306.9764 314.4940 348.7444 364.0495 388.3902 393.0501 420.4478 424.2105 427.7620 446.2660 456.4664 467.8203 480.4313 487.5019 519.6255 530.6459 531.1049 545.9255 584.7548 606.8853 614.2148 632.1396 642.2591 682.7319 710.9372 716.5165 735.5647 741.5470 746.9362 771.7595 786.0874 801.1697 808.2228 813.9725 829.5694 839.2005 842.5187 849.6982 851.8840 879.9143 889.4676 920.0247 929.4744 941.4720 942.8336 952.7674 965.7921 976.1832 984.9155 987.4616 993.9249 995.4752 998.3492 1023.3804 1025.3513 1052.1915 1056.5819 1076.3707 1081.2597 1098.5445 1101.5346 1106.8159 1111.3085 1125.9495 1129.2260 1138.7692 1146.0863 1162.4182 1165.9084 1170.2311 1182.1094 1188.6319 1195.4532 1202.1821 1230.1218 1239.4749 1258.4251 1264.6396 1273.8115 1279.4133 1295.3915 1298.7956 1313.1892 1316.8618 1333.1190 1349.2952 1353.0316 1362.1997 1366.8729 1369.2863 1371.7581 1388.2753 1392.0041 1430.2080 1438.9626 1442.0531 1442.1331 1448.7705 1449.2165 1450.2738 1458.2543 1460.1563 1460.7025 1464.6677 1476.1538 1477.3390 1493.2271 1506.9580 1532.1780 1548.5719 1572.1643 1584.5838 1593.6215 1617.1645 1617.8778 1633.5365 2877.2492 2900.3181 2931.3466 2944.9546 2951.4368 2952.4878 2955.8580 2958.4886 3012.2687 3016.3872 3022.8397 3042.8436 3077.0640 3081.7466 3099.3475 3109.0484 3115.2893 3121.0445 3129.2864 3132.3484 3138.0555 3144.0077 3146.0832 3160.0119 3162.7816 3166.0122 3169.8978
redmass: 5.1404 4.4072 3.9074 3.8968 4.2164 4.4456 3.9666 2.3570 4.9000 3.7626 2.5373 2.5224 4.0469 2.6653 3.6738 1.2647 3.5921 2.8863 3.2969 3.0655 2.5002 3.7390 3.0172 4.3029 3.7107 5.4350 3.1452 2.2758 3.4252 4.0381 3.0687 3.5113 3.9728 2.8995 4.3139 4.1656 3.3016 3.0250 4.1931 3.7153 3.7824 3.0761 6.0847 6.7866 3.5584 4.3622 4.5063 4.1260 4.4295 3.3680 1.9505 2.3722 4.4014 4.0534 1.3224 3.0070 1.6226 2.0134 1.8934 2.3380 2.6111 1.5195 1.8514 2.3726 2.9199 2.9403 1.5539 1.4817 1.3831 1.5559 1.3410 1.5287 3.7681 3.0021 2.8727 2.0519 2.1561 2.0621 1.5047 2.8673 2.9667 2.2102 1.8671 1.2374 1.3254 1.4796 1.7282 1.8489 2.5991 1.2977 1.7099 1.2096 1.8110 1.0892 1.8269 1.7875 1.2200 1.8524 2.8945 1.7651 1.3068 1.3818 1.5403 1.7628 1.4016 1.5821 1.2229 2.8048 1.3817 2.8342 1.2784 3.4655 1.5297 4.3616 2.8514 1.2757 3.2346 2.2827 1.2640 1.0943 2.6796 1.0991 1.9846 1.3089 1.2625 1.0404 3.7212 1.0479 1.1038 1.1387 2.7261 7.0566 6.8286 6.4984 6.9458 7.0411 7.2602 6.3697 1.0682 1.0688 1.0854 1.0368 1.0661 1.0392 1.0662 1.0817 1.1000 1.1023 1.0906 1.0911 1.0967 1.0978 1.0964 1.0944 1.0894 1.0851 1.0889 1.0893 1.0907 1.0947 1.0874 1.1002 1.0956 1.0934 1.0950
irintensity: 0.8891 0.5432 0.4184 0.3899 0.1026 0.1524 0.3450 0.4476 0.7555 2.1426 3.0730 0.9550 0.4585 4.7398 1.8794 0.1147 0.8606 4.1982 7.4158 4.5483 0.7231 1.8022 13.7032 4.7458 14.1340 1.6267 2.1800 0.4192 2.9772 0.6127 0.8123 2.5780 2.7379 1.3951 10.3950 2.1915 12.7731 12.2621 6.7563 12.1172 2.5320 2.4043 12.9725 0.7182 3.8705 8.6261 4.4181 0.9121 10.2075 2.7645 46.2787 59.2961 4.2001 16.6793 13.4965 10.3608 43.7747 10.0046 33.6317 10.8586 2.5672 2.0013 24.1810 2.1227 12.1703 39.6459 1.3418 4.1814 0.4335 19.3338 0.9199 8.4505 13.8269 4.7461 26.2143 6.5667 3.1054 21.5597 26.0067 27.4702 36.7813 5.4735 4.6278 0.0831 1.1408 14.7405 5.7191 38.5850 4.0916 7.2198 13.8115 16.6506 218.5537 2.4475 47.7301 17.1250 13.3519 12.0292 26.4381 6.6284 3.4485 2.3956 10.1212 4.4561 24.7250 20.3482 5.5013 3.1057 1.4683 180.6583 3.3428 190.3365 13.2358 28.1542 0.1966 14.4223 79.2598 2.9769 3.8645 10.0186 48.7407 19.9173 4.6415 38.4781 33.3238 0.3278 2.0315 22.3004 3.8392 62.7824 471.0492 201.6366 254.8908 230.8474 0.7397 75.0019 1.7957 375.7185 59.3198 53.6738 55.9259 100.9709 40.0623 201.4085 100.4561 11.3761 15.8084 65.8295 45.5206 20.4492 37.7284 29.5983 4.1111 54.3537 9.7628 4.2672 17.0086 3.8776 8.2657 28.6693 3.9603 56.2801 13.0055 22.2326 24.4339
temp: 298.150 k
press: 1.00000 atm
elementType: 8 7 7 7 6 6 6 6 6 6 6 6 6 6 6 6 6 6 6 6 6 6 6 6 6 6 6 6 6 6 1 1 1 1 1 1 1 1 1 1 1 1 1 1 1 1 1 1 1 1 1 1 1 1 1 1 1
symmnumber: 1
zpe: 1229375.0 jmol-1
zpe.correction: 0.468244 hartree
zpe.thermalcorrener: 0.494642 hartree
zpe.thermalcorrenthalpy: 0.495586 hartree
zpe.thermalcorrgfe: 0.409685 hartree
zpe.sumelectzpe: -1244.276799 hartree
zpe.sumelectthermal: -1244.250402 hartree
zpe.sumelectthermalent: -1244.249457 hartree
zpe.sumelectthermalfe: -1244.335358 hartree
dipole: -5.2777 0.6707 -0.7995
dipole: 5.3799
quadrupole: -106.2325 -177.0279 -179.0816
quadrupole: -7.0520 2.5696 -8.3377
quadrupole: 47.8815 -22.9139 -24.9676 -7.0520 2.5696 -8.3377
hfenergy: -1244.7450431 hartree
pointgroup: C01 [X(C26H27N3O1)]
dipole: -2.0828167 0.209616 -0.3131051 debye
polarizability: 723.4900461|-38.6085972|302.5875726|4.32214|-11.0385799|172.0379732 unknown
InChI: InChI=1S/C26H27N3O/c1-28(2)21-10-7-19(8-11-21)18-27-20-9-12-23-22-5-3-4-6-24(22)26(25(23)17-20)29-13-15-30-16-14-29/h3-12,17-18,26H,13-16H2,1-2H3
charge 0 multiplicity 1
57 atoms
O  2.366554 4.321727 1.070482
N  3.089215 1.875705 -0.288135
N  -1.578013 -1.483836 0.027602
N  -7.968023 -0.033839 -0.141787
C  3.10783 0.506739 -0.862678
C  2.034981 -0.509883 -0.397675
C  4.407827 -0.243017 -0.546116
C  2.665363 -1.701426 0.074679
C  4.128171 -1.538144 -0.020668
C  3.064853 1.936305 1.194613
C  2.094926 2.805106 -0.873903
C  3.34358 3.37896 1.647581
C  2.403649 4.236319 -0.398988
C  0.637418 -0.404118 -0.428679
C  5.728542 0.198247 -0.716215
C  1.883508 -2.796919 0.506315
C  5.184942 -2.412242 0.318992
C  -0.1632 -1.49657 0.038638
C  0.479136 -2.691661 0.478283
C  6.791021 -0.676954 -0.371202
C  6.517772 -1.971678 0.137696
C  -2.256474 -0.379649 0.260091
C  -3.712135 -0.308496 0.15651
C  -4.394124 0.905502 0.450793
C  -4.496604 -1.432111 -0.237035
C  -6.579312 -0.121592 -0.041574
C  -5.790118 1.007474 0.356743
C  -5.889808 -1.348658 -0.334469
C  -8.650847 1.229441 0.169028
C  -8.755726 -1.203675 -0.555707
H  3.020412 0.637587 -1.962592
H  3.847012 1.265366 1.594494
H  2.081516 1.604045 1.604897
H  1.047512 2.557971 -0.572313
H  2.157738 2.755401 -1.97816
H  3.238312 3.482075 2.740328
H  4.370095 3.673207 1.338908
H  3.407503 4.539862 -0.76781
H  1.64246 4.950633 -0.755315
H  0.144962 0.482907 -0.841564
H  5.928507 1.20489 -1.098936
H  2.355341 -3.724694 0.849008
H  4.984079 -3.412172 0.719983
H  -0.158585 -3.522692 0.795754
H  7.829908 -0.352268 -0.498473
H  7.349492 -2.636641 0.397524
H  -1.750345 0.559149 0.576461
H  -3.813794 1.784963 0.75943
H  -3.975013 -2.36856 -0.461309
H  -6.269416 1.961327 0.592795
H  -6.452799 -2.236047 -0.637088
H  -8.319057 2.050495 -0.498246
H  -8.471537 1.546414 1.216231
H  -9.736316 1.102044 0.034919
H  -8.641784 -2.048832 0.152718
H  -8.4620 -1.559905 -1.563426
H  -9.822404 -0.932485 -0.590735
