program: Gaussian 09
title: 000225625
version: EM64L-G09RevD.01
frameworkgroup: C1[X(C17H13NO3)]
method: RPBEPBE
basis: SDD
operation: Freq
keyword: #p
keyword: freq=noraman
keyword: PBEPBE/SDD
title: #p freq=noraman PBEPBE/SDD
converged: YES YES YES YES
title: Mulliken charges:
elementType: O O O N C C C C C C C C C C C C C C C C C H H H H H H H H H H H H H
charge: -0.262500 -0.417935 -0.248448 -0.480519 -0.696419 0.325061 0.185675 0.275108 0.185961 -0.565236 -0.382869 -0.420779 -0.394021 0.516908 -0.486827 -0.235790 -0.233784 0.232149 -0.301018 -0.213300 0.168797 0.250514 0.250514 0.321723 0.242121 0.242904 0.237274 0.223085 0.226622 0.226407 0.311454 0.244831 0.290558 0.381778
chargesum: 0.00000
title: Mulliken charges with hydrogens summed into heavy atoms:
elementType: O O O N C C C C C C C C C C C C C C C C C
charge: -0.262500 -0.036157 -0.248448 -0.169065 -0.195391 0.325061 0.185675 0.275108 0.185961 -0.243513 -0.140748 -0.177876 -0.156747 0.516908 -0.263742 -0.009168 -0.007377 0.232149 -0.056186 0.077258 0.168797
polarizability: 5.20683803e+02 1.10158432e+01 1.99325794e+02 -9.55108110e-04 -5.15513936e-04 8.03373967e+01
1716.lowfreq: -8.3616 -4.2707 -0.3114 -0.0006 -0.0004 0.0009 22.9713 38.0987 46.3166
frequency: 22.9518 38.0855 46.3164 57.3230 95.4463 117.5294 138.1720 154.1755 172.1457 179.0415 236.1255 239.9713 252.2628 276.5969 344.6603 356.6427 402.2495 422.4685 437.2666 488.0962 500.5715 506.3396 546.5661 570.4187 578.7482 595.9413 604.6304 639.7099 649.5879 653.2076 707.9910 708.9634 728.8325 742.9696 746.5917 771.7419 778.3983 823.6273 826.6992 870.0520 906.3012 910.7064 916.1192 944.3535 946.3214 947.2496 967.6939 976.6525 986.8126 991.9623 994.9717 1025.2158 1057.3341 1097.8381 1126.7771 1132.3332 1138.4564 1167.8685 1171.5458 1188.8841 1202.6891 1218.1204 1226.9479 1274.0748 1291.9315 1306.1929 1313.3336 1327.7648 1372.9514 1388.0112 1424.9990 1444.0147 1451.5198 1459.0023 1488.9626 1511.0111 1588.1132 1590.9029 1595.1713 1620.9288 1623.7613 1630.0388 1657.1216 2985.5459 3030.1291 3107.4082 3112.2254 3122.1656 3129.0486 3142.5921 3147.1239 3161.7648 3170.2075 3182.4479 3520.1615 3520.6581
redmass: 7.2664 7.0532 7.1292 7.1107 5.4130 7.4727 3.8696 4.8361 6.5632 3.0402 6.7902 2.1323 4.0880 9.1953 6.8458 4.0656 6.5600 2.6962 2.9150 4.7265 4.1126 3.1501 5.9826 1.7409 5.9965 2.4434 6.3320 6.4439 1.4273 1.6351 2.8994 5.8868 8.3107 1.6388 6.1181 4.9853 2.1568 4.8511 1.5830 1.3678 2.1410 1.6287 5.3309 3.4841 1.3787 1.4121 4.2084 1.7829 1.3518 1.0879 6.7231 2.1273 2.1891 2.0960 1.9638 1.1524 1.6304 1.2711 1.3891 1.7598 1.8834 1.4635 1.7455 1.9895 1.5688 1.6471 2.1850 2.5627 4.9603 4.6942 1.1713 3.0780 3.4111 2.6322 3.6102 2.2786 8.3315 6.5970 4.3882 7.2561 6.2818 7.9773 6.2452 1.0610 1.0992 1.0921 1.0885 1.0854 1.0896 1.0947 1.0957 1.1003 1.0926 1.0937 1.0759 1.0646
irintensity: 0.3074 0.0012 0.0145 2.7689 8.5982 4.5082 0.6649 0.2112 0.0381 0.4543 2.2356 10.5439 0.0076 0.0925 4.5488 0.5745 20.7666 14.9300 0.0954 31.0462 8.9171 3.6696 1.5386 77.5758 37.6208 0.7298 16.3713 3.2474 118.5991 5.6029 0.3192 6.2741 44.0070 55.0027 0.7663 13.3992 58.7847 0.6983 42.1967 0.0801 4.5288 3.4259 2.5957 27.1843 3.0779 0.8881 15.5019 25.5608 1.4335 63.1883 0.8477 8.1930 538.3616 5.7047 0.6757 0.0097 9.0502 1.7588 2.2490 1.9300 9.7747 34.7820 2.7100 1.1667 7.8882 14.5796 17.6472 218.1630 37.3705 26.5761 12.7062 22.8040 56.4099 1.9422 73.9140 106.0947 101.3585 14.3356 89.7892 0.3999 135.4889 244.8937 150.7679 8.9951 6.0720 2.7328 17.9514 3.8353 1.7130 23.4801 22.0513 52.5992 3.3006 5.0357 26.4227 65.4572
temp: 298.150 k
press: 1.00000 atm
elementType: 8 8 8 7 6 6 6 6 6 6 6 6 6 6 6 6 6 6 6 6 6 1 1 1 1 1 1 1 1 1 1 1 1 1
symmnumber: 1
zpe: 675672.1 jmol-1
zpe.correction: 0.257350 hartree
zpe.thermalcorrener: 0.274777 hartree
zpe.thermalcorrenthalpy: 0.275722 hartree
zpe.thermalcorrgfe: 0.210364 hartree
zpe.sumelectzpe: -934.612415 hartree
zpe.sumelectthermal: -934.594988 hartree
zpe.sumelectthermalent: -934.594043 hartree
zpe.sumelectthermalfe: -934.659401 hartree
dipole: 1.4396 1.7434 -0.0002
dipole: 2.2609
quadrupole: -106.3188 -113.0238 -126.6336
quadrupole: -0.3586 0.0012 -0.0003
quadrupole: 9.0066 2.3016 -11.3082 -0.3586 0.0012 -0.0003
hfenergy: -934.869765 hartree
pointgroup: C01 [X(C17H13N1O3)]
dipole: -0.5679468 0.6845949 -0.0000146 debye
polarizability: 520.7328664|-10.275149|199.2767242|-0.0344789|-0.0207005|80.3374033 unknown
InChI: InChI=1S/C17H13NO3/c19-16(7-8-17(20)21)18-13-5-6-15-12(10-13)9-11-3-1-2-4-14(11)15/h1-8,10,18,20H,9H2
charge 0 multiplicity 1
34 atoms
O  2.582996 -1.465919 0.000107
O  7.641425 -1.118639 -0.000058
O  7.08094 1.142975 -0.00064
N  1.917056 0.798008 -0.00023
C  -2.544626 -1.724884 0.000621
C  -1.586014 -0.539814 0.000325
C  -2.326161 0.681927 0.000192
C  -3.915027 -1.056171 0.000649
C  -3.764288 0.365749 0.000392
C  -0.184057 -0.552841 0.000194
C  -1.64136 1.918718 -0.000084
C  -5.194913 -1.636832 0.000879
C  -4.899194 1.208062 0.000366
C  0.4998 0.697331 -0.000081
C  -0.234242 1.920207 -0.000216
C  -6.333353 -0.791175 0.000853
C  -6.184477 0.618756 0.000598
C  2.868922 -0.22757 -0.000149
C  4.272232 0.281799 -0.00031
C  5.332234 -0.57347 -0.000221
C  6.719651 -0.060718 -0.000387
H  -2.397262 -2.371216 0.887843
H  -2.397445 -2.371508 -0.88642
H  0.39295 -1.479519 0.000299
H  -2.18736 2.8681 -0.000193
H  -5.318282 -2.726019 0.001077
H  -4.792418 2.298813 0.000172
H  0.307908 2.874956 -0.000432
H  -7.337451 -1.229808 0.001032
H  -7.075689 1.256373 0.000582
H  2.285623 1.752755 -0.000416
H  4.464491 1.364405 -0.00051
H  5.174215 -1.656559 -0.000021
H  8.565075 -0.747071 -0.000119
