program: Gaussian 09
title: 000225624
version: EM64L-G09RevD.01
frameworkgroup: C1[X(C17H11NO2)]
method: RPBEPBE
basis: SDD
operation: Freq
keyword: #p
keyword: freq=noraman
keyword: PBEPBE/SDD
title: #p freq=noraman PBEPBE/SDD
converged: YES YES NO NO
title: Mulliken charges:
elementType: O O N C C C C C C C C C C C C C C C C C H H H H H H H H H H H
charge: -0.175035 -0.178320 -0.355578 0.308488 -0.696192 0.184832 0.277553 0.182877 -0.573343 0.529613 -0.400668 -0.380269 -0.421889 -0.392296 -0.235644 -0.234886 0.147460 0.150639 -0.253984 -0.253496 0.250179 0.247298 0.276319 0.242455 0.265256 0.241971 0.239162 0.226095 0.226431 0.277601 0.277373
chargesum: 0.00000
title: Mulliken charges with hydrogens summed into heavy atoms:
elementType: O O N C C C C C C C C C C C C C C C C C
charge: -0.175035 -0.178320 -0.355578 0.308488 -0.198716 0.184832 0.277553 0.182877 -0.297024 0.529613 -0.158213 -0.115014 -0.179918 -0.153134 -0.009549 -0.008455 0.147460 0.150639 0.023617 0.023877
polarizability: 3.26405767e+02 -2.15243331e+00 1.96184333e+02 -1.67293497e+00 -3.87098544e+00 9.05801919e+01
1716.lowfreq: -4.9033 -2.4016 -0.0008 -0.0007 -0.0003 5.1319 34.1660 41.7928 82.1448
frequency: 34.1615 41.7821 82.1441 107.9305 133.9889 144.0152 194.6139 224.1068 238.9251 247.4898 282.4221 337.2853 371.8343 407.2612 420.6031 435.0397 490.4119 497.7034 507.3371 546.4066 559.4537 595.4239 609.2538 626.0610 640.9262 671.8249 684.2760 707.9286 733.5644 741.0895 743.1923 777.4244 814.2265 821.2682 835.1996 850.0055 868.1158 882.0532 937.5120 941.5817 955.8718 969.2749 972.6462 986.9796 996.4582 1004.1498 1025.5529 1058.2286 1094.4512 1100.1556 1132.6428 1133.4704 1156.9364 1169.2545 1188.4427 1203.0565 1211.7382 1253.8175 1286.2800 1301.1627 1306.4170 1350.1941 1377.5541 1391.5088 1426.4607 1443.9140 1454.1940 1464.4044 1492.5222 1588.9705 1591.0971 1591.1681 1621.3945 1622.3962 1629.0559 1675.0277 2983.8545 3028.1205 3122.4353 3129.9201 3140.4130 3143.4948 3161.9257 3171.3361 3184.5914 3206.4989 3235.0725
redmass: 6.1032 5.6659 5.8036 6.0643 5.4971 5.0899 6.8981 6.7656 2.2889 5.8391 4.2357 5.7650 5.5889 8.2585 2.6993 2.8784 7.1324 3.8192 3.6615 5.6644 4.1050 3.2676 9.2810 2.6235 5.3456 6.4082 7.5079 3.0926 6.9219 1.9207 3.9479 2.0184 4.2603 1.8825 1.6142 5.7219 1.4070 1.4288 1.5827 1.3114 1.4292 1.8704 3.3975 1.3341 6.5806 4.2227 2.1319 1.2523 3.9899 2.2814 1.1804 1.9181 1.5093 1.1461 1.6902 1.7668 2.7206 2.1490 1.7188 1.4775 1.9253 6.5301 8.1641 3.7002 1.1542 3.0522 3.4817 2.8128 3.5834 7.2078 6.9917 6.6873 10.0492 7.8461 7.4038 11.4788 1.0609 1.0993 1.0854 1.0894 1.0908 1.0945 1.1003 1.0928 1.0948 1.0894 1.1110
irintensity: 0.4221 0.9827 4.2431 1.3920 3.7394 1.6755 1.2471 1.6786 11.0735 2.2737 0.1291 1.9588 3.2507 11.4042 9.2964 0.9830 1.8026 0.1525 0.3102 0.1460 1.2492 2.0611 6.5704 7.7834 5.2146 5.1829 42.6992 2.5587 3.7545 49.8214 14.2092 43.3722 1.0883 39.3989 49.8429 3.4116 1.2244 8.0006 1.6587 0.0866 1.2948 9.6806 11.8175 0.1721 9.0390 14.8431 2.0043 32.6508 39.3334 28.5147 0.3524 2.8933 10.7560 0.0461 1.8114 2.9021 44.2535 24.1938 1.5244 8.2577 8.8834 366.5645 18.3953 3.4255 15.3429 19.7724 90.2263 29.6041 68.8905 28.8603 12.8008 3.1389 295.8309 82.6439 21.4558 10.3304 11.3831 6.6151 3.4347 4.1672 4.9660 34.9380 41.1820 1.6517 3.1635 0.0044 1.2000
temp: 298.150 k
press: 1.00000 atm
elementType: 8 8 7 6 6 6 6 6 6 6 6 6 6 6 6 6 6 6 6 6 1 1 1 1 1 1 1 1 1 1 1
symmnumber: 1
zpe: 607226.6 jmol-1
zpe.correction: 0.231280 hartree
zpe.thermalcorrener: 0.246244 hartree
zpe.thermalcorrenthalpy: 0.247188 hartree
zpe.thermalcorrgfe: 0.188470 hartree
zpe.sumelectzpe: -858.281378 hartree
zpe.sumelectthermal: -858.266414 hartree
zpe.sumelectthermalent: -858.265470 hartree
zpe.sumelectthermalfe: -858.324188 hartree
dipole: -0.8770 -0.7475 0.1890
dipole: 1.1678
quadrupole: -85.0414 -114.7444 -119.5777
quadrupole: 1.9255 0.5436 -9.8147
quadrupole: 21.4131 -8.2899 -13.1232 1.9255 0.5436 -9.8147
hfenergy: -858.5126581 hartree
pointgroup: C01[X(C17H11N1O2)]
dipole: -0.3455065 -0.2939757 0.0726715 debye
polarizability: 326.3978099|-2.3551563|196.2340278|-1.7342617|-3.238521|90.5384535 unknown
InChI: InChI=1S/C17H11NO2/c19-16-7-8-17(20)18(16)13-5-6-15-12(10-13)9-11-3-1-2-4-14(11)15/h1-8,10H,9H2
charge 0 multiplicity 1
31 atoms
O  -3.528241 2.153497 0.848693
O  -3.048648 -2.22486 -0.852657
N  -2.849714 0.017655 -0.016768
C  0.813087 -0.722284 0.210047
C  1.926606 -1.723375 0.493474
C  1.372325 0.542173 -0.14734
C  3.189763 -0.900178 0.264646
C  2.84225 0.433734 -0.113152
C  -0.575176 -0.908095 0.267391
C  -1.419723 0.186795 -0.055425
C  0.524406 1.627491 -0.457464
C  -0.873593 1.445761 -0.418823
C  4.538181 -1.280718 0.37667
C  3.847538 1.389582 -0.380303
C  5.546967 -0.32107 0.108107
C  5.202661 1.001938 -0.267054
C  -3.793876 1.003635 0.426275
C  -3.556611 -1.16614 -0.41297
C  -5.157213 0.37974 0.287453
C  -5.019226 -0.88098 -0.199435
H  1.873645 -2.59832 -0.183824
H  1.872885 -2.120645 1.526133
H  -1.005707 -1.875654 0.537019
H  0.935545 2.604477 -0.732896
H  -1.541022 2.277873 -0.654185
H  4.812154 -2.301784 0.666271
H  3.588379 2.414265 -0.669696
H  6.602661 -0.602835 0.190601
H  5.996177 1.729707 -0.470471
H  -6.060779 0.9244 0.560944
H  -5.781801 -1.625187 -0.428564
