program: Gaussian 09
title: 000225626
version: EM64L-G09RevD.01
frameworkgroup: C1[X(C17H15NO2)]
method: RPBEPBE
basis: SDD
operation: Freq
keyword: #p
keyword: freq=noraman
keyword: PBEPBE/SDD
title: #p freq=noraman PBEPBE/SDD
converged: YES YES NO NO
title: Mulliken charges:
elementType: O O N C C C C C C C C C C C C C C C C C H H H H H H H H H H H H H H H
charge: -0.160980 -0.273641 -0.209843 0.303213 0.184810 0.286835 0.223596 0.458051 -0.321007 -0.580686 -0.420981 -0.339996 -0.402641 -0.401303 -0.420234 -0.217624 -0.234993 0.218348 -0.662292 -0.807385 0.288351 0.246241 0.312319 0.248447 0.248040 0.245554 0.278449 0.230398 0.235223 0.249741 0.220217 0.225507 0.239131 0.238973 0.272163
chargesum: 0.00000
title: Mulliken charges with hydrogens summed into heavy atoms:
elementType: O O N C C C C C C C C C C C C C C C C C
charge: -0.160980 -0.273641 -0.209843 0.303213 0.184810 0.286835 0.223596 0.458051 -0.321007 -0.292335 -0.174740 -0.027678 -0.154194 0.092291 -0.141785 0.012774 0.000230 0.218348 0.033173 -0.057118
polarizability: 3.59989450e+02 -4.32872436e-01 2.07870863e+02 -3.25897571e+00 -2.80107913e+00 9.00934652e+01
1716.lowfreq: -3.3054 0.0002 0.0004 0.0006 2.2515 9.6806 22.5207 44.7661 74.2855
frequency: 22.3610 44.7588 74.2811 105.4806 122.5918 136.4665 151.7467 161.9640 186.5747 201.7606 210.9469 229.5678 250.5217 293.7412 335.8174 356.9775 402.9598 421.0576 432.3568 448.2705 464.7673 494.8575 516.4184 543.7470 561.6318 579.9736 596.0195 609.6316 638.7753 667.4491 690.3605 725.8708 753.4914 768.6510 784.9292 799.3209 832.6656 855.8557 865.8698 898.9416 921.3461 946.2571 958.4390 968.5642 978.5624 992.7299 996.3547 1004.9958 1028.6075 1031.8103 1072.6076 1078.5066 1097.8216 1111.5251 1134.2095 1160.1147 1172.3886 1187.8945 1226.9447 1239.6350 1251.4657 1293.6551 1294.6840 1339.5530 1348.0701 1364.2033 1380.0497 1393.7421 1401.0628 1445.1854 1448.7813 1449.6779 1458.3202 1467.6676 1476.1617 1486.4755 1492.6753 1514.8076 1587.9241 1590.2868 1598.9641 1603.6460 1624.4614 1638.6163 2991.6257 2993.0064 3038.1114 3080.3387 3081.7934 3089.6693 3105.9094 3129.2807 3130.9892 3139.5737 3142.4156 3151.7977 3167.2351 3172.3823 3211.6825
redmass: 5.4747 4.7042 3.8299 4.7089 4.5740 3.7976 6.4839 3.0059 1.1765 1.1143 2.7282 7.5756 5.1334 6.1074 4.3388 4.4745 3.3602 3.2013 3.2997 3.8554 3.9438 4.1972 5.5962 4.8053 3.3707 4.8094 3.9275 3.6282 6.6939 5.7411 4.0352 5.9952 1.4873 2.7339 2.7322 1.6721 2.7475 1.5770 3.2164 1.4800 1.7536 2.4229 3.6370 1.4770 1.3941 2.6477 1.3568 2.2080 1.6644 2.1048 2.7312 2.4038 1.9622 2.8997 1.9401 1.6519 1.1964 2.0418 2.3257 3.5445 1.6207 1.5354 1.6181 2.1036 1.5513 4.4451 1.2272 2.6676 1.2942 2.5440 1.2785 2.0323 3.7291 1.0526 1.0528 2.2343 1.2728 1.0930 6.7243 8.0811 7.4255 8.0588 7.8039 9.9146 1.0390 1.0366 1.0646 1.0973 1.0971 1.0998 1.1010 1.0860 1.0985 1.0913 1.0902 1.0950 1.1002 1.0907 1.0930
irintensity: 7.0139 1.6433 1.4746 2.3376 1.9534 1.0766 0.1113 0.2736 0.8408 0.4002 2.2081 0.3815 5.1639 3.3159 0.1781 5.4846 1.0278 5.1732 1.0101 3.1633 4.7062 7.6559 3.3745 2.0852 3.4037 1.8537 6.1772 1.2649 4.8922 0.3210 0.5017 0.2208 80.6513 8.8083 28.4509 27.5544 0.4365 32.8377 14.2677 0.9424 13.5134 12.3752 26.1420 5.9246 1.5932 37.1218 0.0828 12.6873 6.3397 2.5563 7.0460 5.4643 9.6795 10.6261 79.3903 27.1364 9.2205 32.4742 32.9979 14.0229 232.4858 50.9835 5.3991 145.4225 91.5183 54.6953 43.3010 15.2495 36.6845 9.3774 19.5754 28.5865 240.9742 2.3024 10.3564 59.2280 23.0469 15.3326 174.0557 21.8396 97.9044 121.2814 57.9422 45.4314 12.0948 19.0723 20.5676 12.2278 8.2583 27.3288 51.9733 3.2440 6.7950 5.9530 6.6320 17.6359 37.5917 6.1495 8.2227
temp: 298.150 k
press: 1.00000 atm
elementType: 8 8 7 6 6 6 6 6 6 6 6 6 6 6 6 6 6 6 6 6 1 1 1 1 1 1 1 1 1 1 1 1 1 1 1
symmnumber: 1
zpe: 724486.5 jmol-1
zpe.correction: 0.275942 hartree
zpe.thermalcorrener: 0.293028 hartree
zpe.thermalcorrenthalpy: 0.293972 hartree
zpe.thermalcorrgfe: 0.230711 hartree
zpe.sumelectzpe: -860.631726 hartree
zpe.sumelectthermal: -860.614640 hartree
zpe.sumelectthermalent: -860.613696 hartree
zpe.sumelectthermalfe: -860.676957 hartree
dipole: 1.2440 0.1383 -1.1240
dipole: 1.6823
quadrupole: -87.8093 -122.4703 -120.4233
quadrupole: 21.6755 -5.2170 1.7344
quadrupole: 22.4250 -12.2360 -10.1890 21.6755 -5.2170 1.7344
hfenergy: -860.9076684 hartree
pointgroup: C01 [X(C17H15N1O2)]
dipole: -0.4869884 -0.0478558 -0.4456427 debye
polarizability: 359.9525937|0.3573309|207.6979362|4.5257702|5.3217032|90.3032476 unknown
InChI: InChI=1S/C17H15NO2/c1-3-18(11(2)19)12-8-9-14-13-6-4-5-7-15(13)17(20)16(14)10-12/h4-10H,3H2,1-2H3
charge 0 multiplicity 1
35 atoms
O  1.605595 -2.794967 -0.141836
O  -3.943941 2.09287 0.408736
N  -3.19564 -0.035552 -0.284165
C  1.031036 0.765343 -0.080355
C  0.51949 -0.561834 -0.129045
C  2.515219 0.698018 -0.030398
C  2.904901 -0.677257 -0.048283
C  -1.782605 0.24412 -0.18838
C  1.669394 -1.533856 -0.110489
C  -0.849334 -0.839658 -0.178733
C  0.122555 1.835522 -0.08265
C  -1.269302 1.577448 -0.135235
C  3.495395 1.704015 0.02646
C  -3.600904 -1.420814 -0.667739
C  4.252838 -1.062861 -0.010394
C  4.862925 1.31785 0.064245
C  5.24206 -0.046494 0.046273
C  -4.200035 0.914891 0.015959
C  -3.764672 -2.381445 0.530772
C  -5.658605 0.488906 -0.171561
H  -1.158319 -1.887376 -0.197731
H  0.46423 2.875639 -0.046075
H  -1.972317 2.408989 -0.117604
H  3.223214 2.764905 0.042134
H  -4.546752 -1.363827 -1.228333
H  -2.852976 -1.811129 -1.378228
H  4.523996 -2.123735 -0.024462
H  5.63875 2.09058 0.108319
H  6.303383 -0.314838 0.076611
H  -2.83501 -2.468467 1.117694
H  -4.558791 -2.036325 1.216015
H  -4.038796 -3.389838 0.170672
H  -5.917778 -0.440666 0.363405
H  -5.90512 0.350464 -1.241052
H  -6.277487 1.308978 0.220554
