program: Gaussian 09
title: 000225627
version: EM64L-G09RevD.01
frameworkgroup: C1[X(C17H15NO3)]
method: RPBEPBE
basis: SDD
operation: Freq
keyword: #p
keyword: freq=noraman
keyword: PBEPBE/SDD
title: #p freq=noraman PBEPBE/SDD
converged: YES YES NO NO
title: Mulliken charges:
elementType: O O O N C C C C C C C C C C C C C C C C C H H H H H H H H H H H H H H H
charge: -0.253719 -0.253092 -0.256558 -0.452615 -0.412134 0.356866 0.312518 0.177709 0.177289 -0.578682 -0.386344 -0.417810 -0.397537 0.527973 -0.488637 -0.245092 -0.228158 0.326662 0.209741 -0.762175 -0.800240 0.275391 0.328659 0.242626 0.275816 0.239802 0.220081 0.228712 0.226421 0.310636 0.256845 0.249558 0.245074 0.236969 0.270317 0.237131
chargesum: 0.00000
title: Mulliken charges with hydrogens summed into heavy atoms:
elementType: O O O N C C C C C C C C C C C C C C C C C
charge: -0.253719 -0.253092 -0.256558 -0.141979 -0.136743 0.356866 0.312518 0.177709 0.177289 -0.250023 -0.143718 -0.141994 -0.157735 0.527973 -0.268556 -0.016380 -0.001737 0.326662 0.209741 -0.010700 -0.055823
polarizability: 3.27403813e+02 -1.27537785e+01 2.24712544e+02 -6.64192196e+00 -1.52697036e+01 1.03481419e+02
1716.lowfreq: -67.7413 -20.7940 -4.9076 -3.2496 -0.0006 -0.0003 0.0008 5.2782 32.1028
frequency: -67.7375 -20.5814 32.0893 46.1440 54.9745 66.7084 69.3709 106.1290 109.9464 142.1625 174.3936 206.8055 215.9946 253.1162 284.4203 288.9908 346.2704 355.4358 403.0685 429.8003 446.6322 466.1041 517.7222 536.9022 546.3529 564.7154 571.2869 583.1454 616.1130 632.9987 643.5436 646.2574 668.2055 725.4343 737.2919 752.4601 778.5508 796.5893 830.8949 845.9517 866.1104 888.6607 917.2822 929.2047 944.5224 947.4581 957.2876 960.8041 989.4545 990.3451 998.3557 1002.2458 1027.1767 1030.5864 1046.9124 1096.6558 1129.3182 1147.0362 1168.7211 1180.1450 1193.2538 1203.0240 1218.4593 1234.6618 1272.9983 1287.0181 1298.0117 1310.4887 1368.9306 1376.0758 1383.7154 1389.3229 1441.1451 1447.0862 1454.8122 1456.8923 1458.5711 1462.3446 1469.1368 1492.3758 1512.9561 1594.6026 1599.6454 1618.9049 1630.1885 1633.1839 1636.2349 2987.3158 3009.0440 3011.0779 3072.2505 3097.4066 3111.0877 3125.0605 3136.8904 3137.5367 3142.0996 3146.9374 3151.3542 3165.5826 3190.4767 3521.2775
redmass: 1.0545 1.1055 5.7757 8.4574 4.4178 3.3836 4.2177 4.8098 4.4999 3.8381 7.2388 5.6159 5.7135 4.8053 4.3784 4.7382 5.1057 4.6591 3.3125 4.5934 3.1092 3.7135 4.9539 4.3239 4.8056 3.7324 3.1521 3.9047 3.6481 3.8673 5.5137 1.2901 5.7744 4.5966 4.1322 1.8944 2.2360 4.2941 1.6213 3.7666 4.2664 1.5991 4.0768 6.4845 1.5817 1.8342 1.6782 1.6660 2.6262 1.4165 1.8617 2.3984 2.1052 1.6589 1.6181 1.9976 1.8568 1.3920 1.2221 1.9531 2.4748 2.1002 1.9404 2.3546 1.7737 1.5896 1.3731 2.2022 5.3468 1.2767 1.2279 4.1872 1.9243 1.7685 1.0745 1.8782 1.0470 3.8423 1.0468 4.0270 2.0465 6.9588 6.4706 7.2005 7.5065 5.1267 9.9251 1.0384 1.0365 1.0832 1.0984 1.0973 1.0886 1.0858 1.0978 1.0902 1.1012 1.0955 1.0948 1.1000 1.0936 1.0764
irintensity: 0.0269 1.8238 0.6254 1.1165 9.4139 5.3788 0.8833 2.3905 1.6380 0.1688 3.3823 3.9715 5.4111 1.4258 1.9196 2.0116 0.7665 0.3723 0.3829 7.0360 3.0499 20.4733 2.1722 4.7772 4.0764 2.3069 2.4003 2.1252 15.5111 6.2938 9.1910 50.1608 2.0293 0.5571 10.0867 47.7928 53.8780 10.3322 41.7231 12.9305 10.3208 2.7999 54.4405 18.4491 12.7130 23.3774 19.1863 23.1961 18.5024 3.0155 36.8388 5.7050 8.3024 7.7022 6.9630 3.7359 7.4118 15.0110 19.6899 168.2253 80.7421 131.4485 12.4006 101.3022 16.4318 25.5460 3.4594 15.6532 69.8950 72.6830 46.2183 62.0167 55.5869 89.9993 10.1529 10.4838 12.9696 163.1276 19.6950 184.6928 166.6069 3.0951 66.6084 9.1764 59.0959 116.1719 159.4395 10.0920 3.3018 12.0401 15.3126 5.2041 25.4503 2.4075 6.8387 7.7350 7.1092 13.6425 23.5801 31.1447 6.9075 12.9210
temp: 298.150 k
press: 1.00000 atm
elementType: 8 8 8 7 6 6 6 6 6 6 6 6 6 6 6 6 6 6 6 6 6 1 1 1 1 1 1 1 1 1 1 1 1 1 1 1
symmnumber: 1
zpe: 730683.2 jmol-1
zpe.correction: 0.278303 hartree
zpe.thermalcorrener: 0.295611 hartree
zpe.thermalcorrenthalpy: 0.296555 hartree
zpe.thermalcorrgfe: 0.231749 hartree
zpe.sumelectzpe: -935.798358 hartree
zpe.sumelectthermal: -935.781050 hartree
zpe.sumelectthermalent: -935.780106 hartree
zpe.sumelectthermalfe: -935.844911 hartree
dipole: -2.6378 -3.8807 2.1896
dipole: 5.1780
quadrupole: -95.4622 -110.9628 -127.2205
quadrupole: 10.3925 0.2309 4.9879
quadrupole: 15.7530 0.2524 -16.0053 10.3925 0.2309 4.9879
hfenergy: -936.0766607 hartree
pointgroup: C01 [X(C17H15N1O3)]
dipole: -0.5654274 -1.8027271 0.7619992 debye
polarizability: 326.2087906|16.8277914|227.3823165|-2.4426704|-9.4532574|102.0066695 unknown
InChI: InChI=1S/C17H15NO3/c1-10(19)18-12-7-8-14-13-5-3-4-6-15(13)17(16(14)9-12)21-11(2)20/h3-9,17-18H,1-2H3
charge 0 multiplicity 1
36 atoms
O  0.360696 1.977735 0.680564
O  1.148257 3.679403 -0.711406
O  -4.381714 0.354844 -0.36133
N  -3.566474 -1.811977 0.040096
C  0.711603 0.967731 -0.379858
C  -0.15892 -0.263278 -0.175003
C  2.128841 0.423093 -0.234682
C  0.665894 -1.404839 0.04283
C  2.081618 -0.982448 0.010044
C  -1.556312 -0.339339 -0.185188
C  0.0675 -2.665512 0.243799
C  3.353796 1.100411 -0.337016
C  3.27449 -1.718791 0.162571
C  -2.156117 -1.61485 0.026085
C  -1.339224 -2.762777 0.234693
C  4.553547 0.359266 -0.1753
C  4.511424 -1.034831 0.072249
C  0.61628 3.316694 0.364257
C  -4.588603 -0.874235 -0.143876
C  0.164654 4.228836 1.483687
C  -5.993232 -1.474197 -0.058125
H  0.561873 1.467565 -1.356486
H  -2.188765 0.535924 -0.34076
H  0.674115 -3.56263 0.406304
H  3.380709 2.175245 -0.543035
H  3.25328 -2.799007 0.345028
H  -1.814128 -3.740227 0.391982
H  5.520963 0.86807 -0.248986
H  5.448409 -1.590766 0.190703
H  -3.868934 -2.77502 0.206702
H  -0.268591 3.65567 2.315303
H  -0.582734 4.940973 1.092903
H  1.02472 4.819634 1.843622
H  -6.147746 -2.250722 -0.830337
H  -6.725767 -0.669978 -0.215541
H  -6.176311 -1.931871 0.931907
