program: Gaussian 09
title: 000225671
version: EM64L-G09RevD.01
frameworkgroup: C1[X(C17H16N4O2)]
method: RPBEPBE
basis: SDD
operation: Freq
keyword: #p
keyword: freq=noraman
keyword: PBEPBE/SDD
title: #p freq=noraman PBEPBE/SDD
converged: YES YES NO NO
title: Mulliken charges:
elementType: O O N N N N C C C C C C C C C C C C C C C C C H H H H H H H H H H H H H H H H
charge: -0.206700 -0.191332 -0.306268 -0.411888 0.002826 -0.067210 0.079023 0.202849 0.059551 0.091592 0.154987 -0.797538 0.186187 -0.285367 0.182924 -0.161675 -0.386854 -0.346189 0.234057 -0.136742 -0.365656 -0.770724 -0.778807 0.349848 0.234095 0.305734 0.238197 0.269771 0.238567 0.239417 0.238554 0.240187 0.241106 0.244231 0.217130 0.248570 0.225857 0.244653 0.243039
chargesum: 0.00000
title: Mulliken charges with hydrogens summed into heavy atoms:
elementType: O O N N N N C C C C C C C C C C C C C C C C C
charge: -0.206700 -0.191332 -0.306268 -0.062040 0.002826 -0.067210 0.079023 0.202849 0.059551 0.091592 0.154987 -0.019513 0.186187 -0.015596 0.182924 0.076891 -0.147437 -0.107635 0.234057 0.103445 -0.124550 -0.060792 -0.065258
polarizability: 3.88483163e+02 -2.43132607e+01 2.44711127e+02 5.64346788e-01 -1.93962940e+00 1.12160814e+02
1716.lowfreq: -2.8141 0.0005 0.0005 0.0006 1.3905 4.7488 8.8621 31.1421 37.2899
frequency: 8.0627 31.1273 37.2613 57.1665 64.4833 69.6759 80.2123 96.6613 109.5778 141.2232 147.4563 182.4986 193.0286 197.0752 222.5971 243.1257 255.1598 264.7088 287.7870 301.8896 325.7326 372.4462 427.1954 438.4526 439.8312 444.2598 508.9772 535.8907 538.1088 550.8293 588.5212 602.4043 604.8978 631.4049 647.9242 712.1038 716.1347 729.5893 735.5774 742.8096 766.6362 771.0003 785.5845 802.9234 806.5287 884.0392 894.0654 899.1682 933.9328 946.4294 963.2778 976.8441 984.4481 988.7902 998.3372 1026.2106 1046.0453 1047.6437 1049.1464 1063.3187 1071.3914 1092.1451 1093.7772 1164.7151 1176.3338 1179.9674 1221.7029 1242.7929 1258.6304 1294.0200 1300.6285 1323.0030 1349.5600 1364.1197 1388.9092 1390.9843 1395.4927 1403.6419 1419.9341 1441.1468 1444.2713 1455.7792 1457.4446 1459.4445 1474.0759 1477.0378 1480.9416 1533.1623 1570.0865 1579.7269 1582.6938 1589.0293 1628.7521 1666.8976 1696.0262 2973.7310 2990.4464 2992.0693 3050.6841 3074.4818 3078.5437 3101.8947 3103.3162 3118.4088 3136.4967 3142.7712 3153.9466 3164.0639 3173.1677 3193.9071 3377.8813
redmass: 3.8162 4.2206 4.5325 3.6358 2.7221 1.2976 1.1479 4.3317 2.1157 1.6982 8.0910 4.6006 2.9386 3.5015 5.2795 5.1882 5.0220 4.3507 4.2073 6.1598 4.2439 3.1712 4.0775 6.0680 3.6184 3.8739 7.0075 5.5731 5.3298 7.3134 4.6874 3.5026 6.3090 7.3883 6.6794 6.6741 7.8762 1.8025 2.2829 6.0337 1.6234 3.0229 4.5371 1.9353 1.8597 1.3812 3.5754 1.3693 2.8137 4.2778 3.8892 3.1556 1.3352 1.3480 2.1349 2.5823 1.5847 1.5908 1.4396 3.3342 3.8504 1.6393 1.6123 1.9568 1.1685 1.3114 2.7046 2.1417 3.2613 3.7624 4.1019 7.6840 3.8829 4.4910 1.7513 1.3790 1.2363 2.1522 3.1449 2.0425 2.3148 1.0458 1.0586 1.0871 1.1625 1.2135 1.0509 2.3918 6.5944 5.4732 5.5946 3.8793 6.2347 9.9517 9.3346 1.0398 1.0369 1.0364 1.0935 1.0973 1.0974 1.1005 1.1000 1.0996 1.0884 1.0882 1.0930 1.0964 1.0995 1.0970 1.0746
irintensity: 0.1014 2.0002 1.2907 1.5995 1.1180 2.3097 0.2502 1.1301 1.7890 0.0156 1.1066 1.5492 0.4198 6.3444 8.1174 2.4299 6.4994 0.6007 1.1786 10.9211 1.8927 1.1571 2.9450 6.6196 1.0069 6.3743 5.4790 3.4135 0.4991 9.2091 5.7762 0.1040 24.9555 13.6763 3.8714 0.7887 8.0834 12.4572 10.7880 7.7113 15.6493 42.8925 22.4930 10.1705 126.8525 5.3681 3.1446 1.2317 8.5119 4.4134 77.5712 6.2926 0.9788 0.3550 12.4225 76.1873 10.1600 9.1040 8.6724 11.3065 86.1066 17.4736 5.5959 3.7798 1.2141 20.8062 67.1890 1.4077 97.6953 7.2397 73.9822 24.5963 13.5521 497.4222 136.0898 54.6164 2.2244 114.0703 54.8088 237.3148 127.7560 14.0937 21.6994 1.8719 137.2287 69.9803 5.0631 620.8104 114.0792 34.5748 223.1136 272.0519 388.9095 175.6924 88.3428 24.6228 15.3448 18.0923 16.3365 12.9476 11.9966 22.6892 22.3997 6.9072 5.9642 7.0261 12.4639 25.0876 16.3975 1.3071 85.2391
temp: 298.150 k
press: 1.00000 atm
elementType: 8 8 7 7 7 7 6 6 6 6 6 6 6 6 6 6 6 6 6 6 6 6 6 1 1 1 1 1 1 1 1 1 1 1 1 1 1 1 1
symmnumber: 1
zpe: 786020.2 jmol-1
zpe.correction: 0.299379 hartree
zpe.thermalcorrener: 0.320640 hartree
zpe.thermalcorrenthalpy: 0.321584 hartree
zpe.thermalcorrgfe: 0.246295 hartree
zpe.sumelectzpe: -1025.273754 hartree
zpe.sumelectthermal: -1025.252494 hartree
zpe.sumelectthermalent: -1025.251550 hartree
zpe.sumelectthermalfe: -1025.326838 hartree
dipole: 2.7295 -1.4507 -0.6145
dipole: 3.1515
quadrupole: -89.5305 -133.9710 -135.7763
quadrupole: -3.1881 2.8742 -4.1535
quadrupole: 30.2287 -14.2117 -16.0170 -3.1881 2.8742 -4.1535
hfenergy: -1025.5731337 hartree
pointgroup: C01 [X(C17H16N4O2)]
dipole: 1.0843293 0.5555538 0.2301108 debye
polarizability: 389.5021799|21.0955788|243.3480378|1.0621897|-6.830598|112.5048864 unknown
InChI: InChI=1S/C17H16N4O2/c1-10-6-4-8-13(18-10)20-15-12(3)16(22)21(17(15)23)14-9-5-7-11(2)19-14/h4-9,20H,1-3H3
charge 0 multiplicity 1
39 atoms
O  -0.817975 1.857294 0.662171
O  -1.534291 -2.742888 -0.075614
N  -1.630586 -0.377213 0.301412
N  1.710816 0.90924 0.270655
N  -3.535247 0.878731 -0.326302
N  3.710129 -0.394997 0.192185
C  0.693715 -0.023194 0.188447
C  0.517447 -1.37745 -0.033679
C  -0.667194 0.636327 0.403567
C  -0.944455 -1.642126 0.048267
C  -3.051388 -0.205252 0.331058
C  1.440294 -2.519897 -0.344117
C  3.111986 0.824106 0.243599
C  -3.865163 -1.150794 1.001584
C  -4.886061 1.099873 -0.316679
C  -5.257883 -0.934001 0.982919
C  3.849474 2.045324 0.288408
C  -5.778677 0.204953 0.326984
C  5.079688 -0.460652 0.178273
C  5.251473 1.969701 0.279913
C  5.884379 0.702974 0.223913
C  -5.36322 2.338354 -1.042648
C  5.67766 -1.849502 0.117108
H  1.325372 1.855627 0.423032
H  1.347151 -2.813278 -1.408272
H  2.481753 -2.232132 -0.144178
H  1.157645 -3.408282 0.249112
H  -3.422034 -2.014539 1.500253
H  -5.927882 -1.641164 1.482789
H  3.333619 3.010749 0.324079
H  -6.855395 0.39901 0.307512
H  5.848964 2.886499 0.31389
H  6.974445 0.617607 0.216225
H  -5.043467 2.309777 -2.099612
H  -6.460966 2.435797 -1.004781
H  -4.90818 3.240298 -0.595781
H  6.779494 -1.816629 0.111779
H  5.345902 -2.450632 0.982764
H  5.33556 -2.377221 -0.791535
