program: Gaussian 09
title: 000225619
version: EM64L-G09RevD.01
frameworkgroup: C1[X(C15H16N2O)]
method: RPBEPBE
basis: SDD
operation: Freq
keyword: #p
keyword: freq=noraman
keyword: PBEPBE/SDD
title: #p freq=noraman PBEPBE/SDD
converged: YES YES NO NO
title: Mulliken charges:
elementType: O N N C C C C C C C C C C C C C C C H H H H H H H H H H H H H H H H
charge: -0.435261 -0.252088 -0.691327 -0.337603 0.203495 0.268570 0.217899 0.148241 -0.566930 0.251844 -0.636314 0.410437 -0.405151 -0.386121 -0.234123 -0.236191 -0.620339 -0.619737 0.245345 0.277985 0.226711 0.257701 0.235856 0.335375 0.226225 0.224328 0.310250 0.302732 0.241751 0.218854 0.179385 0.219917 0.240977 0.177307
chargesum: 0.00000
title: Mulliken charges with hydrogens summed into heavy atoms:
elementType: O N N C C C C C C C C C C C C C C C
charge: -0.099886 -0.252088 -0.078345 -0.092258 0.203495 0.268570 0.217899 0.148241 -0.288946 0.251844 -0.409603 0.410437 -0.147450 -0.150265 -0.007898 -0.011863 0.019651 0.018463
polarizability: 2.92024119e+02 1.72427535e+00 1.82993350e+02 1.31110565e+00 6.52737411e+00 9.70443843e+01
1716.lowfreq: -18.1707 -8.1949 -4.3751 -0.0003 -0.0001 0.0006 2.6819 44.8824 91.4352
frequency: -17.6504 44.8590 91.4328 99.5369 108.0147 138.7479 143.7488 175.4431 181.8955 192.1998 235.3387 259.8107 269.0750 290.4325 341.0792 353.0822 372.2030 389.8879 396.0520 405.3038 431.8942 457.5339 500.3955 522.2491 543.3043 569.2699 600.8566 633.3054 667.5521 704.4528 727.6570 740.1849 753.7681 775.1281 803.4861 846.9077 864.5722 882.5381 895.6790 928.3151 950.2289 953.4258 983.4372 985.8703 1020.4879 1029.6909 1049.3172 1090.8192 1093.9102 1098.2531 1127.4201 1165.0365 1174.5633 1177.5147 1190.6096 1200.0189 1220.4531 1223.7288 1248.3729 1263.7867 1295.2923 1338.3605 1353.5910 1371.9136 1412.6914 1422.7777 1426.6047 1441.3155 1446.8179 1462.8218 1470.8190 1476.7072 1479.1056 1490.6766 1504.2770 1578.4753 1593.8176 1618.1130 1621.6106 1634.6966 2834.1728 2846.0645 2990.2470 2993.0692 3020.3814 3078.8612 3082.3976 3112.0200 3121.8725 3132.7146 3144.8894 3149.5381 3161.2004 3542.9378 3572.7557 3716.1114
redmass: 2.5427 4.3056 3.2926 2.8645 3.6054 3.8168 1.4320 1.7749 1.5993 3.6161 3.7885 3.1681 4.0763 4.1001 1.2343 1.3224 3.5461 2.1891 2.8600 1.4750 3.0696 3.6763 3.7696 4.6624 4.8741 4.4239 4.5664 4.7494 5.6721 5.3645 5.5175 2.4952 2.9046 2.0593 3.1032 3.2128 1.7409 1.5592 4.4374 1.4384 1.5331 4.4992 3.1354 1.3237 1.9546 1.6245 1.4518 2.1272 1.2307 1.8127 1.3517 1.2958 1.2968 3.4164 1.7474 1.2834 1.9630 5.3215 1.5020 2.3894 1.9468 3.6049 1.1708 7.7874 4.3314 1.1164 2.1251 1.4564 2.4920 1.0554 1.2923 2.2249 1.0533 3.5192 1.3172 8.1766 6.7683 7.2339 1.6860 2.6028 1.0586 1.0603 1.0725 1.0744 1.0835 1.0967 1.0973 1.0912 1.0852 1.0893 1.0947 1.0923 1.1002 1.0661 1.0446 1.1039
irintensity: 0.1059 0.4785 1.8791 2.2670 1.5238 0.4702 1.2308 1.6928 3.1057 0.8329 2.8996 0.4309 9.8321 0.6851 253.8136 94.2477 12.4459 5.6096 10.4235 0.3414 5.4497 6.0702 6.2455 2.7276 5.7743 8.5895 8.8294 8.4590 5.0627 4.1605 4.0937 39.1428 15.3607 61.7354 14.5641 7.5798 27.3920 0.7041 29.1287 6.6667 8.9997 65.6504 3.3211 0.0141 2.6489 16.9675 12.0985 29.5736 6.8840 19.6245 1.6631 11.1825 8.3186 35.9942 5.7400 21.6540 1.7756 30.6745 30.6307 11.5615 2.0528 19.7488 47.9672 67.6099 33.0729 5.4012 5.0484 27.3118 29.9438 3.7677 22.2190 74.2992 21.8459 59.6631 7.4102 11.7548 3.2984 7.5205 17.2510 247.0135 92.8379 240.9090 115.2308 20.9526 14.7354 15.8097 41.8445 16.6584 2.6249 6.0570 26.8030 5.9328 38.4421 5.7543 66.2462 26.3367
temp: 298.150 k
press: 1.00000 atm
elementType: 8 7 7 6 6 6 6 6 6 6 6 6 6 6 6 6 6 6 1 1 1 1 1 1 1 1 1 1 1 1 1 1 1 1
symmnumber: 1
zpe: 720892.8 jmol-1
zpe.correction: 0.274574 hartree
zpe.thermalcorrener: 0.290668 hartree
zpe.thermalcorrenthalpy: 0.291612 hartree
zpe.thermalcorrgfe: 0.232051 hartree
zpe.sumelectzpe: -764.624936 hartree
zpe.sumelectthermal: -764.608841 hartree
zpe.sumelectthermalent: -764.607897 hartree
zpe.sumelectthermalfe: -764.667458 hartree
dipole: -2.3833 -3.5251 -0.5758
dipole: 4.2939
quadrupole: -87.8388 -101.7228 -106.9616
quadrupole: 2.2238 0.0892 1.7816
quadrupole: 11.0023 -2.8817 -8.1205 2.2238 0.0892 1.7816
hfenergy: -764.8995094 hartree
pointgroup: C01 [X(C15H16N2O1)]
dipole: 0.9180038 1.4177748 -0.0331734 debye
polarizability: 291.9394022|3.3689527|183.3154486|1.7232889|4.6615043|96.8070029 unknown
InChI: InChI=1S/C15H16N2O/c1-17(2)14-8-12-11(7-13(14)16)9-5-3-4-6-10(9)15(12)18/h3-8,15,18H,16H2,1-2H3
charge 0 multiplicity 1
34 atoms
O  -1.244369 -2.78895 -0.989101
N  3.777652 -0.588884 0.064733
N  2.951178 2.175203 0.150142
C  -1.19816 -1.79324 0.106994
C  0.028606 -0.884315 0.098994
C  -0.363551 0.486558 0.126299
C  -2.351665 -0.784164 0.086691
C  -1.843952 0.549137 0.118015
C  1.390848 -1.222147 0.081185
C  2.383147 -0.21134 0.089277
C  0.595628 1.512826 0.144586
C  1.981109 1.172919 0.12803
C  -3.732387 -1.030897 0.044632
C  -2.728836 1.647783 0.119422
C  -4.623322 0.07445 0.038084
C  -4.123347 1.399461 0.079757
C  4.542734 -0.545267 1.317956
C  4.538928 -0.408944 -1.17821
H  -1.237591 -2.436439 1.005557
H  1.721965 -2.265484 0.051415
H  0.295006 2.56792 0.173313
H  -4.112467 -2.057718 0.008628
H  -2.353636 2.67722 0.148217
H  -1.169451 -2.297272 -1.847631
H  -5.705195 -0.096216 0.002436
H  -4.824473 2.24195 0.078521
H  3.93684 1.935135 0.142757
H  2.686606 3.155018 0.179053
H  3.892487 -0.842492 2.157954
H  5.385802 -1.262163 1.266791
H  4.977958 0.456635 1.56788
H  5.373527 -1.136807 -1.213313
H  3.88271 -0.600807 -2.043792
H  4.98747 0.60883 -1.315169
