program: Gaussian 09
title: 000225612
version: EM64L-G09RevD.01
frameworkgroup: C1[X(C6H12O5)]
method: RPBEPBE
basis: SDD
operation: Freq
keyword: #pfreq=noraman
keyword: PBEPBE/SDD
title: #p freq=noraman PBEPBE/SDD
converged: YES YES NO NO
title: Mulliken charges:
elementType: O O O O O C C C C C C H H H H H H H H H H H H
charge: -0.467519 -0.467643 -0.484251 -0.455573 -0.190664 -0.141588 -0.051094 -0.123578 -0.454277 -0.382245 -0.068503 0.228625 0.227920 0.218161 0.229852 0.227036 0.212241 0.258936 0.370013 0.365188 0.377403 0.214678 0.356882
chargesum: 0.00000
title: Mulliken charges with hydrogens summed into heavy atoms:
elementType: O O O O O C C C C C C
charge: -0.097506 -0.102454 -0.106848 -0.098691 -0.190664 0.087037 0.176825 0.094583 0.002611 0.088932 0.146175
polarizability: 9.59102853e+01 -1.75921756e+00 8.37617197e+01 5.16889311e-01 7.68900715e-02 6.56415187e+01
1716.lowfreq: -19.6327 -9.0615 -5.6487 0.0001 0.0007 0.0011 46.0402 48.4285 70.6620
frequency: 45.6017 48.2853 70.6460 82.5327 103.9762 153.5733 172.1203 236.8209 289.2342 308.3628 317.1836 328.1032 363.5964 428.1678 457.7211 523.0481 537.5602 558.0309 613.4950 666.8925 707.4106 801.2459 829.2332 876.4405 908.4042 934.6769 996.7851 1019.1456 1020.5964 1044.2341 1062.5674 1079.8848 1094.4524 1144.4308 1190.1445 1191.6456 1242.8234 1263.0378 1271.7889 1298.2253 1315.7531 1316.8593 1344.2011 1355.2107 1376.6145 1377.8089 1385.2205 1400.3275 1418.6431 1456.0038 1640.1023 2939.6030 2955.6754 2971.3404 2975.3423 3004.0660 3029.5697 3066.4893 3102.5692 3399.1286 3457.5357 3462.4421 3572.9282
redmass: 5.0985 5.4705 3.6845 3.9968 3.9102 3.1938 4.1641 4.3463 4.7904 2.5824 5.2654 1.3690 5.9872 3.4947 3.3070 1.3199 1.8672 2.4115 1.1548 1.4277 1.9646 1.8934 3.0660 2.6085 2.9490 4.6613 2.3053 3.1649 2.7335 2.2773 2.7552 2.3527 3.4516 1.3429 1.2842 1.2730 1.2379 1.1403 1.2188 1.2602 1.2676 1.2636 1.2013 1.1821 1.2787 1.2039 1.5232 1.6291 1.0933 1.0781 7.5142 1.0870 1.0829 1.0842 1.0635 1.0642 1.0856 1.0977 1.1023 1.0639 1.0649 1.0644 1.0666
irintensity: 5.6439 4.2111 3.0973 11.5969 2.5752 1.4394 9.3250 5.4239 16.9507 67.9548 18.8311 55.0296 7.6679 15.0193 10.0004 49.5986 21.1026 40.2957 51.5208 215.3569 153.1768 14.7191 19.1960 24.5714 26.8771 79.1753 27.7790 93.6266 6.5956 51.2252 31.7411 0.3057 44.3303 37.3543 15.1504 40.0436 11.5589 21.9095 24.6892 71.0098 3.3500 35.4537 4.5348 26.6434 69.3575 16.9730 53.8004 14.9847 12.1148 7.3782 175.5192 58.4424 18.9248 40.5925 14.9666 24.8257 43.4968 23.2967 12.6790 70.2364 58.1373 31.5818 13.0163
temp: 298.150 k
press: 1.00000 atm
elementType: 8 8 8 8 8 6 6 6 6 6 6 1 1 1 1 1 1 1 1 1 1 1 1
symmnumber: 1
zpe: 482128.3 jmol-1
zpe.correction: 0.183633 hartree
zpe.thermalcorrener: 0.196397 hartree
zpe.thermalcorrenthalpy: 0.197341 hartree
zpe.thermalcorrgfe: 0.143573 hartree
zpe.sumelectzpe: -611.006609 hartree
zpe.sumelectthermal: -610.993845 hartree
zpe.sumelectthermalent: -610.992901 hartree
zpe.sumelectthermalfe: -611.046669 hartree
dipole: -4.4912 -1.4195 -1.6484
dipole: 4.9903
quadrupole: -83.5087 -68.3087 -63.8543
quadrupole: 12.7388 -1.0684 4.9262
quadrupole: -11.6182 3.5819 8.0362 12.7388 -1.0684 4.9262
hfenergy: -611.1902422 hartree
pointgroup: C01 [X(C6H12O5)]
dipole: -1.8054525 0.325936 0.6991102 debye
dipolederiv: -0.8160162 -0.0877129 0.0333242 -0.1377188 -0.7056317 -0.1416686 0.0115083 -0.1268798 -0.3426981 -0.5941381 0.2250468 0.0810186 0.1749473 -0.6942807 0.0086298 0.1094531 0.0327629 -0.5096427 -0.5300854 -0.0202199 -0.0565541 -0.0107733 -0.5026744 0.0595074 -0.1418755 0.018645 -0.754195 -0.8767075 0.2777508 0.1118235 0.2873679 -0.3133803 0.1344198 0.0659441 0.1261291 -0.5046403 -0.6442373 -0.1749698 0.0841665 -0.3882517 -0.7721351 0.0864755 0.1614992 0.0990515 -0.3461127 0.3866641 0.1989027 0.0209361 0.1118606 0.3411763 0.1217887 0.1024635 0.0693819 0.3001757 0.2954126 -0.1469726 0.0537426 0.0291121 0.5413883 -0.0694093 0.0807887 0.0209776 0.3132996 0.1600188 0.1439003 0.0939191 0.0364712 0.2419806 0.0216449 0.1641976 0.0509242 0.4111137 -0.4424332 -0.2782562 0.1559853 -0.1653592 -0.1121033 -0.0158815 0.2503652 0.0302738 0.0071874 0.5190007 -0.2238683 0.0527248 -0.2072436 0.3208194 -0.080715 -0.0156572 -0.0398584 0.2333925 1.0001637 0.2742944 -0.3253364 0.263257 0.87556 -0.0651341 -0.4680782 -0.1914245 0.2051481 0.0464014 -0.0214701 -0.0209215 -0.0192059 0.0308545 0.0041813 -0.0151749 -0.0229958 -0.1346967 0.0182776 0.0268988 -0.0386539 0.006721 -0.0339972 0.0300918 -0.0584514 0.0591055 -0.144158 0.0340489 -0.0649865 -0.0144377 -0.1067395 -0.1635369 -0.0554144 -0.000699 -0.0241893 -0.017359 -0.0021944 0.0788701 0.015534 0.112671 -0.0561387 -0.0120147 -0.0096152 0.0047076 0.0922886 0.0648961 -0.0290495 -0.0069953 0.0335382 0.1007676 0.078147 -0.036446 0.0287029 -0.0651628 0.0173774 0.0315518 -0.0552038 0.0267922 0.0425036 -0.0867481 -0.0456734 -0.0429845 -0.1429349 0.0474929 -0.0201335 -0.0082044 -0.0371136 -0.0599479 0.0449194 -0.0335881 -0.0032403 0.0909837 0.3802753 -0.047982 -0.0292795 -0.0638487 0.3799989 0.0746753 -0.0120217 0.0351557 0.1993173 0.3571354 -0.1455742 -0.0616089 -0.0853536 0.2596462 -0.0277523 -0.0887732 -0.0385115 0.3208661 0.2646211 0.0251471 -0.0670995 0.0625082 0.2890727 -0.0038672 -0.0227247 -0.0002142 0.4029954 -0.0304019 0.0891185 0.0619243 0.131586 -0.0957162 -0.0452737 0.081279 -0.0233471 0.0886113 0.3444281 -0.1102858 -0.0808039 -0.0552249 0.0857745 -0.0606019 -0.0787203 -0.0621726 0.2962205 unknown
polarizability: 95.3709072|3.0658814|84.215319|-0.8436105|1.0543264|65.7272975 unknown
InChI: InChI=1S/C6H12O5/c7-2-1-4(9)6(11)5(10)3-8/h2,4-6,8-11H,1,3H2
charge 0 multiplicity 1
23 atoms
O  -0.800544 -2.044382 -0.176926
O  1.862475 -1.592308 -0.096711
O  -1.801868 0.032532 -1.458467
O  -3.851385 0.886411 0.110482
O  3.56505 2.178934 -0.281363
C  -0.386067 -0.724176 0.33214
C  1.01891 -0.400319 -0.245426
C  -1.463748 0.313552 -0.050183
C  1.739021 0.738001 0.501858
C  -2.745238 0.181798 0.797575
C  3.113521 1.023542 -0.09074
H  -0.311335 -0.835222 1.430451
H  0.902625 -0.146386 -1.322198
H  -1.057979 1.343711 0.03204
H  1.154173 1.674909 0.50898
H  1.891335 0.404688 1.550189
H  -2.590759 0.565205 1.824777
H  -3.064403 -0.872019 0.842147
H  -1.260617 -1.848032 -1.04495
H  1.265219 -2.369622 -0.281989
H  -2.737594 0.353949 -1.58744
H  3.709587 0.113786 -0.338537
H  -3.822379 1.853046 0.323592
