program: Gaussian 09
title: 000225621
version: EM64L-G09RevD.01
frameworkgroup: C1[X(C16H13NO2)]
method: RPBEPBE
basis: SDD
operation: Freq
keyword: #p
keyword: freq=noraman
keyword: PBEPBE/SDD
title: #p freq=noraman PBEPBE/SDD
converged: YES YES NO NO
title: Mulliken charges:
elementType: O O N C C C C C C C C C C C C C C C C H H H H H H H H H H H H H
charge: -0.149761 -0.249970 -0.226281 0.298072 0.204865 0.282211 0.219324 -0.311013 -0.514874 0.476380 -0.417598 -0.374389 -0.400355 -0.416658 -0.218681 -0.234191 -0.665212 0.204688 -0.798406 0.324682 0.244583 0.242721 0.244739 0.279493 0.229551 0.235217 0.255695 0.252484 0.233552 0.236725 0.240523 0.271885
chargesum: 0.00000
title: Mulliken charges with hydrogens summed into heavy atoms:
elementType: O O N C C C C C C C C C C C C C C C C
charge: -0.149761 -0.249970 -0.226281 0.298072 0.204865 0.282211 0.219324 -0.311013 -0.190192 0.476380 -0.173015 -0.131668 -0.155616 -0.137165 0.010870 0.001027 0.076518 0.204688 -0.049273
polarizability: 3.37713734e+02 -1.37343053e+00 1.92817602e+02 -4.00511575e+00 5.35352004e+00 8.57954758e+01
1716.lowfreq: -2.9272 -0.0008 -0.0007 0.0001 5.7730 6.3166 36.3025 49.6095 76.2697
frequency: 36.2584 49.5945 76.2685 111.6472 128.4511 139.7153 152.8409 183.3207 196.4845 214.3421 257.1255 258.6185 290.1555 340.6803 379.3452 403.5102 404.8576 435.1419 458.1498 487.8431 517.1893 550.7364 555.1914 571.7284 592.9513 608.3769 640.8468 673.0144 692.7684 723.6277 752.5006 783.0743 784.6130 832.2991 841.8380 859.2271 897.5204 927.2664 949.6986 955.8357 968.3531 989.6768 996.0984 998.2047 1027.7139 1030.6974 1070.8504 1090.7973 1107.7025 1116.5693 1139.9537 1156.8366 1171.1701 1189.1580 1224.9597 1251.0666 1281.6722 1294.9565 1330.6756 1365.5293 1380.2139 1392.3410 1439.2334 1443.8180 1449.1866 1450.9315 1464.5215 1470.7931 1483.4338 1490.3373 1495.4536 1593.7290 1597.6076 1601.1765 1602.8597 1623.8847 1640.2685 2973.4445 2988.1509 3074.0963 3076.2523 3120.8997 3127.9696 3131.8642 3135.0198 3141.0616 3151.3780 3159.2001 3166.9725 3201.6564
redmass: 5.9930 4.2404 3.6389 5.3365 3.2863 4.4412 4.2257 1.3314 2.7867 1.3736 4.7535 6.8566 4.9303 3.9748 4.1444 3.2304 3.2981 3.0979 4.6348 4.5086 5.7583 3.8549 5.6157 4.0605 3.8592 4.1995 6.6553 5.9258 3.9580 6.0552 1.5011 3.5917 3.5943 2.7268 1.5792 4.5133 1.4958 1.7581 3.0995 1.5771 1.4772 1.9925 1.3605 3.1778 2.0793 1.6753 2.6224 1.8358 1.4378 1.6765 3.4631 1.6919 1.1930 2.3279 1.8831 4.7232 1.5263 1.7738 3.4335 8.2126 1.2428 3.2744 1.1590 2.4929 2.5162 1.1621 3.7991 1.0806 3.7726 1.0522 1.0626 7.4887 7.6278 7.3865 7.8653 7.7472 10.2737 1.0442 1.0387 1.0955 1.0933 1.0998 1.0861 1.0980 1.0884 1.0899 1.0947 1.0952 1.1002 1.0933
irintensity: 0.8322 6.2491 1.9244 0.9947 0.7705 0.3226 1.2255 0.3317 0.4533 0.3215 5.4615 8.6101 2.0103 3.0902 3.7212 1.7856 0.8198 0.1242 2.9429 7.5538 2.8567 8.3226 1.4134 2.2561 0.7531 12.8744 7.3811 0.1942 0.6861 0.6336 78.0636 18.4978 15.9646 3.3886 26.7812 35.7103 0.5124 9.1946 16.6130 4.2395 5.6224 55.0251 0.1134 11.0897 4.7422 7.2717 5.6148 18.1713 12.6429 85.4645 23.0583 14.0340 10.8307 40.5409 4.8565 23.4671 26.2477 22.1879 380.0601 11.4920 66.0788 0.0347 48.7352 24.8048 19.6139 11.8255 153.4247 20.0487 46.4517 14.6629 32.6421 134.0147 74.8433 28.7777 77.6787 24.1164 103.3532 56.8512 10.7809 30.3962 5.1824 24.0612 3.7537 5.7265 7.4437 5.0622 15.3015 20.3037 34.4854 2.6846
temp: 298.150 k
press: 1.00000 atm
elementType: 8 8 7 6 6 6 6 6 6 6 6 6 6 6 6 6 6 6 6 1 1 1 1 1 1 1 1 1 1 1 1 1
symmnumber: 1
zpe: 649482.8 jmol-1
zpe.correction: 0.247375 hartree
zpe.thermalcorrener: 0.263308 hartree
zpe.thermalcorrenthalpy: 0.264253 hartree
zpe.thermalcorrgfe: 0.203823 hartree
zpe.sumelectzpe: -821.405585 hartree
zpe.sumelectthermal: -821.389652 hartree
zpe.sumelectthermalent: -821.388708 hartree
zpe.sumelectthermalfe: -821.449137 hartree
dipole: -1.7636 -6.7723 1.3335
dipole: 7.1241
quadrupole: -74.1095 -112.7951 -114.9282
quadrupole: 6.5065 -7.9167 2.2974
quadrupole: 26.5014 -12.1842 -14.3173 6.5065 -7.9167 2.2974
hfenergy: -821.6529603 hartree
pointgroup: C01 [X(C16H13N1O2)]
dipole: -0.6719223 2.67499 -0.4987499 debye
polarizability: 337.7641018|0.0317557|192.7090321|2.6515869|6.2030113|85.8536771 unknown
InChI: InChI=1S/C16H13NO2/c1-10(18)17(2)11-7-8-13-12-5-3-4-6-14(12)16(19)15(13)9-11/h3-9H,1-2H3
charge 0 multiplicity 1
32 atoms
O  1.153794 -2.735037 -0.470982
O  -3.547129 -1.617564 0.91219
N  -3.412215 0.465849 -0.161016
C  0.849815 0.819395 0.07308
C  0.231207 -0.450434 -0.133896
C  2.323777 0.632338 0.092482
C  2.604716 -0.753897 -0.107416
C  1.306488 -1.500047 -0.265688
C  -1.155871 -0.611628 -0.203828
C  -1.977201 0.547562 -0.061421
C  0.043555 1.959704 0.210041
C  -1.365232 1.814656 0.144453
C  3.379482 1.545731 0.262068
C  3.919111 -1.243042 -0.140798
C  4.712545 1.054629 0.230801
C  4.984179 -0.321494 0.032347
C  -4.127072 1.639307 -0.713125
C  -4.1274 -0.636717 0.362418
C  -5.650336 -0.59673 0.238705
H  -1.592094 -1.599395 -0.357058
H  0.477238 2.952003 0.374394
H  -1.990903 2.703096 0.276415
H  3.191216 2.613933 0.416306
H  4.105933 -2.310752 -0.296519
H  5.546585 1.753186 0.362989
H  6.02163 -0.671929 0.013726
H  -5.051337 1.320194 -1.216235
H  -3.489751 2.133881 -1.463702
H  -4.393697 2.377888 0.068469
H  -5.976029 -0.665535 -0.816257
H  -6.089311 0.31923 0.672631
H  -6.040594 -1.470878 0.779726
