program: Gaussian 09
title: 000225581
version: EM64L-G09RevD.01
frameworkgroup: C1[X(C12H17NO)]
method: RPBEPBE
basis: SDD
operation: Freq
keyword: #p
keyword: freq=noraman
keyword: PBEPBE/SDD
title: #p freq=noraman PBEPBE/SDD
converged: YES YES NO NO
title: Mulliken charges:
elementType: O N C C C C C C C C C C C C H H H H H H H H H H H H H H H H H
charge: -0.473425 -0.258255 -0.108349 -0.408556 -0.411242 -0.366353 -0.287409 -0.467177 0.414203 -0.429540 -0.392279 -0.224358 -0.232535 -0.241300 0.225260 0.214797 0.217523 0.189746 0.210474 0.194555 0.190953 0.225889 0.217176 0.199563 0.269314 0.346749 0.236716 0.268439 0.225610 0.225301 0.228507
chargesum: 0.00000
title: Mulliken charges with hydrogens summed into heavy atoms:
elementType: O N C C C C C C C C C C C C
charge: -0.126676 0.011060 0.116911 0.023765 -0.011021 0.019155 -0.061520 -0.050437 0.414203 -0.192823 -0.123840 0.001251 -0.007234 -0.012793
polarizability: 1.67503750e+02 1.48330994e+01 1.09021601e+02 -5.96389815e+00 9.28457288e+00 1.21479250e+02
1716.lowfreq: -0.0007 -0.0003 0.0007 0.7575 15.1039 20.1098 36.1946 62.4828 70.4709
frequency: 35.9979 62.2557 70.1877 125.6956 195.3682 220.9216 239.3478 264.4582 268.9096 311.7758 343.3299 385.5470 405.7662 433.7137 442.6778 512.6488 539.4051 613.5353 617.5594 666.1006 707.3255 715.5087 765.2850 792.9302 814.8037 837.5634 856.9406 858.9179 891.4028 923.5419 935.1024 944.6378 958.1460 980.6788 989.2394 996.6112 1026.1981 1047.8931 1060.4201 1071.7831 1082.5709 1106.5818 1116.2982 1154.3939 1171.0175 1181.8687 1196.1275 1201.5812 1214.8204 1249.0895 1263.7752 1292.6324 1301.6989 1315.0453 1330.7784 1334.8013 1340.7065 1341.7469 1352.2765 1357.3431 1386.9682 1438.6501 1441.6392 1456.2610 1461.0994 1465.8714 1471.7676 1481.2150 1593.1301 1612.6137 2958.3156 2960.2218 2965.1020 2966.2955 2969.3528 2984.0694 3024.4174 3029.7323 3043.1667 3051.4114 3113.9672 3124.3537 3137.4165 3149.5495 3162.9625 3418.3357 3573.5336
redmass: 3.7173 3.1620 4.4168 3.3919 4.0422 4.1979 2.1055 2.9093 4.2602 1.1907 1.9875 3.8074 2.8206 3.2953 3.0941 2.3472 2.0636 5.2659 5.4244 3.8002 1.8323 1.6906 1.9608 2.4622 2.0046 2.1175 2.2955 1.2862 1.8608 1.4796 1.7855 2.3493 2.2708 1.3945 5.7733 1.3220 2.1222 2.1752 2.0568 1.5514 1.6161 1.7736 1.9620 1.9189 1.0601 1.1230 1.5374 1.9634 1.7087 1.2405 1.2926 1.5511 1.3085 1.2460 1.3215 1.4487 1.5347 1.3357 1.3872 1.3905 5.5187 2.1195 1.1439 1.0864 1.1253 1.0880 1.0948 2.3099 6.1603 6.0984 1.0818 1.0630 1.0641 1.0637 1.0828 1.0604 1.0960 1.0999 1.1023 1.1033 1.0869 1.0863 1.0918 1.0953 1.1013 1.0735 1.0662
irintensity: 0.3221 0.6552 0.2766 2.0203 0.2755 3.5334 4.6276 2.0252 7.1999 117.0298 25.2335 3.0571 1.0192 0.7324 1.9067 16.5277 1.8332 4.4760 6.0757 51.0251 85.2378 56.1044 61.8744 10.8913 3.0464 27.3743 9.3985 0.4544 10.7263 5.2445 6.8277 3.8190 23.8105 0.9202 0.1145 0.6201 7.9868 8.7723 55.7506 6.2437 8.6883 11.2136 7.6059 30.0911 0.5061 2.2286 11.2384 2.4621 25.6023 6.8782 0.9110 10.8520 12.8758 1.6784 3.8327 2.6363 2.9704 4.4096 3.6728 2.6866 0.3452 12.0767 40.2511 7.0243 9.2774 7.1335 6.5976 11.5373 0.6106 3.9716 16.1743 39.7525 39.0355 57.8272 38.8072 24.0897 60.4631 75.3645 33.6693 73.1322 7.4975 0.3943 20.7558 28.9682 22.3680 3.1039 7.1098
temp: 298.150 k
press: 1.00000 atm
elementType: 8 7 6 6 6 6 6 6 6 6 6 6 6 6 1 1 1 1 1 1 1 1 1 1 1 1 1 1 1 1 1
symmnumber: 1
zpe: 701470.5 jmol-1
zpe.correction: 0.267176 hartree
zpe.thermalcorrener: 0.279964 hartree
zpe.thermalcorrenthalpy: 0.280908 hartree
zpe.thermalcorrgfe: 0.227672 hartree
zpe.sumelectzpe: -596.372600 hartree
zpe.sumelectthermal: -596.359812 hartree
zpe.sumelectthermalent: -596.358868 hartree
zpe.sumelectthermalfe: -596.412104 hartree
dipole: 1.0504 0.3200 0.1528
dipole: 1.1086
quadrupole: -79.0930 -84.7111 -81.0877
quadrupole: -1.2778 -0.8992 -0.8665
quadrupole: 2.5376 -3.0805 0.5429 -1.2778 -0.8992 -0.8665
hfenergy: -596.639776 hartree
pointgroup: C01 [X(C12H17N1O1)]
dipole: 0.4149342 0.1191509 0.0622934 debye
polarizability: 168.2646458|13.2682876|109.0509796|-5.5199178|10.0009601|120.6889758 unknown
InChI: InChI=1S/C12H17NO/c14-12(10-6-2-1-3-7-10)11-8-4-5-9-13-11/h1-3,6-7,11-14H,4-5,8-9H2
charge 0 multiplicity 1
31 atoms
O  -0.426661 -1.359311 1.678673
N  -2.475506 -1.123449 -0.270148
C  -1.24367 -0.290348 -0.32503
C  -1.408759 1.095655 0.357468
C  -2.64539 1.832007 -0.215928
C  -3.919221 0.96052 -0.102703
C  -0.083434 -1.137737 0.254632
C  -3.680355 -0.418503 -0.773946
C  1.294956 -0.505691 0.087316
C  2.035179 -0.74379 -1.098103
C  1.852689 0.326197 1.090535
C  3.304058 -0.151618 -1.285899
C  3.124316 0.914576 0.907163
C  3.853238 0.680352 -0.282113
H  -1.009122 -0.119567 -1.397662
H  -0.498052 1.705135 0.20297
H  -1.527638 0.943226 1.447689
H  -2.465128 2.072567 -1.285219
H  -2.787853 2.797234 0.306878
H  -4.171631 0.809071 0.966981
H  -4.782697 1.469114 -0.576193
H  -0.113241 -2.109142 -0.284442
H  -4.55399 -1.082189 -0.634823
H  -3.555612 -0.269527 -1.866493
H  -2.606593 -1.467383 0.6937
H  0.22743 -1.992583 2.06712
H  1.617954 -1.398113 -1.87444
H  1.282138 0.503235 2.008658
H  3.866567 -0.344416 -2.206501
H  3.546001 1.555997 1.689626
H  4.839827 1.135983 -0.423464
