program: Gaussian 09
title: 000225556
version: EM64L-G09RevD.01
frameworkgroup: C1[X(C10H22O2)]
method: RPBEPBE
basis: SDD
operation: Freq
keyword: #pfreq=noraman
keyword: PBEPBE/SDD
title: #p freq=noraman PBEPBE/SDD
converged: YES YES NO NO
title: Mulliken charges:
elementType: O O C C C C C C C C C C H H H H H H H H H H H H H H H H H H H H H H
charge: -0.444211 -0.465817 -0.420328 -0.390450 -0.060640 -0.375092 -0.374968 -0.353865 -0.380046 -0.428749 -0.356674 -0.696176 0.226885 0.192314 0.190512 0.196108 0.191912 0.198492 0.189064 0.191268 0.188628 0.187662 0.189917 0.183972 0.217640 0.214006 0.247573 0.194318 0.195537 0.209479 0.215217 0.210478 0.371769 0.344266
chargesum: 0.00000
title: Mulliken charges with hydrogens summed into heavy atoms:
elementType: O O C C C C C C C C C C
charge: -0.072443 -0.121551 -0.001129 -0.003830 0.131272 0.012464 0.004928 0.023714 0.021566 0.032829 0.033180 -0.061002
polarizability: 1.47920215e+02 -1.01928256e+00 1.00895839e+02 1.33854530e+00 9.87637585e-01 1.01497705e+02
1716.lowfreq: -5.6537 -0.0003 0.0004 0.0007 9.6376 24.5893 28.4542 45.4454 49.3491
frequency: 28.4266 45.3157 49.2638 71.7508 95.9971 109.7694 121.3115 139.5550 151.9398 167.9187 199.6462 221.4468 235.3063 268.5451 305.3946 342.2260 373.5125 403.6533 470.4969 503.4169 607.6063 657.4998 719.8033 728.0274 757.7324 806.4479 826.1448 887.8173 891.7314 911.9249 933.4926 943.4509 978.6499 998.0316 1012.9552 1029.3198 1038.5924 1056.1414 1074.9195 1080.1662 1089.2194 1112.7542 1141.2284 1159.1932 1189.0047 1211.2840 1221.7646 1232.9487 1258.7340 1270.9095 1280.8933 1283.0611 1292.3818 1293.6395 1306.7686 1327.1273 1337.6281 1349.8598 1354.4452 1355.3709 1359.4651 1377.9761 1389.5307 1389.7111 1458.9912 1461.3231 1463.6686 1467.8300 1470.6536 1475.8364 1475.9208 1476.6580 1483.3761 1488.2987 2938.9729 2950.1070 2951.8187 2953.0842 2956.0436 2962.2224 2965.7289 2968.6293 2972.0738 2984.9368 2988.4089 2992.7092 3002.7317 3016.1885 3029.6110 3041.4156 3068.3634 3069.0296 3070.9198 3086.8832 3483.0647 3575.1205
redmass: 3.7961 1.7862 3.7692 3.4870 2.0248 2.0891 3.6913 2.4151 2.1527 2.2478 3.8989 1.1437 4.0918 2.6262 2.2747 1.3852 2.6996 3.6840 2.7951 2.8942 2.3658 1.1075 1.0631 1.0926 1.1751 2.2749 1.4559 1.8761 1.4207 2.0051 3.4233 1.7959 1.4362 3.8951 2.4157 1.8793 2.3145 2.0108 2.1966 2.2232 1.8634 1.9116 1.7549 1.8149 1.6682 1.2555 1.3387 1.3600 1.2602 1.2419 1.0326 1.2117 1.1453 1.0844 1.3207 1.4060 1.3354 1.5152 1.3638 1.6025 1.5227 1.2129 1.2175 1.1916 1.0732 1.0723 1.0732 1.0751 1.0728 1.0468 1.0795 1.0730 1.0866 1.0918 1.0780 1.0590 1.0590 1.0603 1.0609 1.0615 1.0719 1.0594 1.0366 1.0960 1.0669 1.0968 1.1000 1.1026 1.1040 1.1043 1.1006 1.0950 1.0993 1.0992 1.0649 1.0663
irintensity: 0.8389 0.9103 1.0786 1.8518 1.0335 1.7015 5.3235 0.7290 0.3615 0.3634 0.8684 0.0015 0.4501 7.9932 5.3846 129.5421 9.8304 11.8470 0.2457 1.2929 29.2380 162.9988 15.3289 0.4136 7.1219 2.9691 0.2040 2.8265 10.9669 38.6244 29.9981 57.9231 11.4584 10.0479 14.3973 12.2683 19.4468 3.2742 7.3932 1.2984 27.0629 41.7665 0.5735 28.4987 0.4036 13.4683 2.6426 0.5768 0.7160 0.5901 0.4027 2.4662 0.1616 0.3880 4.7499 1.8757 2.1105 2.8119 14.5023 2.9232 1.9212 15.0570 11.3965 22.8770 1.1759 0.0203 0.3721 1.6465 3.7246 12.9819 0.5312 2.8709 3.9326 27.1430 10.1467 0.7924 0.8865 7.6712 0.5639 14.9218 98.8190 200.4011 35.3422 3.5690 50.8244 4.0300 2.4244 4.4321 0.1512 175.5055 87.9117 48.3882 55.0849 22.3805 34.2064 8.1999
temp: 298.150 k
press: 1.00000 atm
elementType: 8 8 6 6 6 6 6 6 6 6 6 6 1 1 1 1 1 1 1 1 1 1 1 1 1 1 1 1 1 1 1 1 1 1
symmnumber: 1
zpe: 804972.3 jmol-1
zpe.correction: 0.306598 hartree
zpe.thermalcorrener: 0.322425 hartree
zpe.thermalcorrenthalpy: 0.323369 hartree
zpe.thermalcorrgfe: 0.262041 hartree
zpe.sumelectzpe: -543.662922 hartree
zpe.sumelectthermal: -543.647095 hartree
zpe.sumelectthermalent: -543.646151 hartree
zpe.sumelectthermalfe: -543.707479 hartree
dipole: -0.8807 -2.2734 2.5041
dipole: 3.4949
quadrupole: -83.4891 -80.1808 -76.0928
quadrupole: -7.5972 10.6706 1.2621
quadrupole: -3.5682 -0.2599 3.8281 -7.5972 10.6706 1.2621
hfenergy: -543.9695195 hartree
pointgroup: C01 [X(C10H22O2)]
dipole: 0.3044791 0.846505 1.0398855 debye
polarizability: 147.9763151|-0.3837288|100.9832563|0.0815661|-1.0415352|101.3541885 unknown
InChI: InChI=1S/C10H22O2/c1-2-3-4-5-6-7-10(8-11)9-12/h10-12H,2-9H2,1H3
charge 0 multiplicity 1
34 atoms
O  -3.676746 -1.651497 -1.021006
O  -5.143936 0.613606 -0.114066
C  -1.314077 0.528417 -0.438834
C  -0.072122 0.125298 0.386933
C  -2.664213 0.253072 0.274891
C  1.25666 0.367185 -0.364132
C  2.504025 -0.029293 0.457481
C  3.833401 0.213161 -0.292278
C  -3.053512 -1.253982 0.246303
C  -3.771929 1.100061 -0.397629
C  5.080817 -0.190085 0.527007
C  6.404521 0.057307 -0.228488
H  -1.319418 -0.017062 -1.404646
H  -1.238297 1.608788 -0.687609
H  -0.064197 0.695171 1.340119
H  -0.13759 -0.946478 0.66641
H  -2.568927 0.552681 1.342465
H  1.247197 -0.203857 -1.31569
H  1.328407 1.43873 -0.646072
H  2.432387 -1.101394 0.737147
H  2.512143 0.540204 1.41064
H  3.909298 1.285789 -0.568945
H  3.825297 -0.353298 -1.247006
H  -3.728125 -1.488844 1.096872
H  -2.153694 -1.885101 0.341124
H  -3.675251 2.167666 -0.115997
H  -3.689428 1.018519 -1.493704
H  5.08742 0.374261 1.482036
H  5.004785 -1.262405 0.800693
H  6.520824 1.127533 -0.484245
H  7.279967 -0.242441 0.376666
H  6.434235 -0.5173 -1.17353
H  -4.562899 -1.196775 -1.040256
H  -5.338325 0.713466 0.851142
