program: Gaussian 09
title: 000225563
version: EM64L-G09RevD.01
frameworkgroup: C1[X(C15H14ClNO)]
method: RPBEPBE
basis: SDD
operation: Freq
keyword: #p
keyword: freq=noraman
keyword: PBEPBE/SDD
title: #p freq=noraman PBEPBE/SDD
converged: YES YES NO NO
title: Mulliken charges:
elementType: Cl O N C C C C C C C C C C C C C C C H H H H H H H H H H H H H H
charge: -0.076344 -0.448088 -0.083035 -0.587148 -0.517934 0.617339 0.089351 0.324139 -0.314176 -0.403561 -0.374010 -0.351708 -0.231502 -0.232220 -0.230233 -0.260236 -0.239567 -0.236673 0.260953 0.232646 0.249472 0.236048 0.242472 0.248835 0.302544 0.254788 0.231525 0.235343 0.229727 0.227251 0.230383 0.373621
chargesum: 0.00000
title: Mulliken charges with hydrogens summed into heavy atoms:
elementType: Cl O N C C C C C C C C C C C C C C C
charge: -0.076344 -0.074468 -0.083035 -0.093550 -0.032413 0.617339 0.089351 0.324139 -0.314176 -0.161089 -0.125175 -0.049164 0.023286 -0.000695 0.005109 -0.030509 -0.012316 -0.006290
polarizability: 2.40431192e+02 -1.49006761e+01 2.14641135e+02 1.70315450e+01 5.90851922e+00 9.16056034e+01
1716.lowfreq: -4.4272 -0.0014 0.0009 0.0020 3.5818 7.3077 17.6680 31.4111 41.9209
frequency: 17.6465 31.3738 41.9148 64.9329 85.7688 103.3784 153.7737 172.2537 229.2426 242.4230 270.1706 300.1407 321.0475 356.8632 376.0133 401.7309 420.7249 425.7070 448.2892 462.5036 484.8039 527.1831 559.2936 611.6169 618.8139 653.8204 677.3796 699.3046 715.4471 732.9970 758.7592 781.7797 788.1477 832.3433 855.6027 866.5438 883.9562 937.9327 947.7581 985.3965 985.8804 988.4844 991.3730 1003.5851 1008.6742 1022.5642 1026.9461 1038.9391 1066.2443 1092.9280 1118.0179 1157.9788 1173.6419 1175.7615 1208.2078 1213.8290 1256.1565 1262.5494 1267.6894 1284.5611 1300.6355 1333.9642 1338.8395 1374.2390 1378.6184 1425.3891 1435.5883 1462.5306 1471.2796 1481.3929 1490.1352 1566.5745 1573.6653 1580.7564 1606.0760 1608.9534 3005.7862 3016.3874 3061.4856 3084.1246 3125.7411 3127.1942 3137.5363 3142.3196 3154.1253 3159.3575 3166.6800 3174.8480 3209.8574 3560.8123
redmass: 7.1459 4.4768 5.4029 4.6892 5.1072 5.7532 5.2205 4.9585 5.0909 4.1510 5.5789 4.4136 4.4517 5.4272 3.5861 2.6241 2.3463 4.2151 3.1618 1.5377 4.0836 3.8396 6.2695 4.6081 5.2143 6.1544 4.9375 1.6478 4.9941 4.0340 1.2598 1.4515 1.8116 3.5160 1.2471 1.6718 4.0088 1.4381 1.4063 1.4690 1.4196 3.7637 2.5862 1.3358 4.9720 3.5171 2.9963 2.0989 2.2354 1.6794 1.6143 1.1737 1.0630 1.0605 1.1340 2.3607 1.8678 2.0182 1.3033 1.3208 1.2783 1.3391 1.3826 7.0129 7.1092 2.1787 2.2969 2.3334 1.3499 1.2810 1.3679 5.4119 6.0524 5.8542 7.2262 5.8340 1.0603 1.0603 1.1001 1.1031 1.0852 1.0873 1.0900 1.0895 1.0946 1.0949 1.0985 1.0996 1.0939 1.0673
irintensity: 0.4710 0.0482 0.7375 0.3468 0.2260 0.0804 0.0428 1.7582 0.8370 0.7453 2.3667 0.4465 0.4202 4.1910 5.5511 7.1151 48.0234 6.5713 22.6951 63.0376 2.2106 6.2946 16.8396 8.3954 5.8920 9.3624 30.7726 79.1186 6.6074 19.6900 78.4948 10.5010 22.7788 8.5945 1.7390 29.0272 104.5125 7.3613 2.4788 0.7319 0.8524 3.3621 16.8956 1.8442 30.2861 21.1203 15.5884 8.5584 11.6451 1.1849 1.4963 10.3993 0.4714 1.8051 1.8541 0.4734 37.2210 25.8237 24.1142 20.8096 11.1544 5.6896 1.8969 1.8447 1.6630 16.7469 11.9650 27.5541 31.5331 12.7485 11.1639 5.0090 8.1367 0.5100 0.5579 0.9080 1.0324 29.8170 0.6061 16.8497 0.0723 4.2030 17.4877 9.0362 28.3073 16.6453 14.0033 14.5634 6.1382 52.7919
temp: 298.150 k
press: 1.00000 atm
elementType: 17 8 7 6 6 6 6 6 6 6 6 6 6 6 6 6 6 6 1 1 1 1 1 1 1 1 1 1 1 1 1 1
symmnumber: 1
zpe: 656413.0 jmol-1
zpe.correction: 0.250015 hartree
zpe.thermalcorrener: 0.266134 hartree
zpe.thermalcorrenthalpy: 0.267078 hartree
zpe.thermalcorrgfe: 0.204057 hartree
zpe.sumelectzpe: -1168.703105 hartree
zpe.sumelectthermal: -1168.686986 hartree
zpe.sumelectthermalent: -1168.686042 hartree
zpe.sumelectthermalfe: -1168.749063 hartree
dipole: -1.1147 0.9992 0.5424
dipole: 1.5922
quadrupole: -95.0976 -100.8546 -116.7075
quadrupole: -2.5034 3.1945 1.9891
quadrupole: 9.1223 3.3653 -12.4876 -2.5034 3.1945 1.9891
hfenergy: -1168.9531197 hartree
pointgroup: C01[X(C15H14Cl1N1O1)]
dipole: -0.5121244 0.247963 0.2620242 debye
polarizability: 237.972685|-23.3001302|190.8872896|27.2825676|43.8126347|117.8179551 unknown
InChI: InChI=1S/C15H14ClNO/c16-14-9-5-4-6-12(14)10-11-15(17-18)13-7-2-1-3-8-13/h1-9,18H,10-11H2
charge 0 multiplicity 1
32 atoms
Cl -1.448124 -2.137794 -1.67321
O  2.657208 3.077054 0.944418
N  1.358933 2.654094 0.399212
C  -0.926768 0.141031 0.486893
C  -0.103169 1.048582 -0.481838
C  -2.351583 -0.049907 -0.002126
C  1.294117 1.373471 0.050244
C  2.331339 0.307375 0.121271
C  -2.722374 -1.009406 -0.974408
C  -3.396398 0.780712 0.488231
C  2.112198 -0.918537 -0.578975
C  3.542436 0.437495 0.869155
C  -4.039077 -1.163314 -1.44808
C  -4.726614 0.655658 0.033139
C  -5.051041 -0.319303 -0.937703
C  3.05946 -1.961006 -0.54372
C  4.481253 -0.614504 0.909573
C  4.251153 -1.816988 0.203365
H  -0.422362 -0.83475 0.599733
H  -0.941073 0.62321 1.481237
H  -0.638623 2.004595 -0.613931
H  -0.04231 0.569921 -1.476346
H  -3.145707 1.534816 1.243885
H  1.201277 -1.062329 -1.16764
H  3.737945 1.362609 1.410374
H  -4.26807 -1.925943 -2.198115
H  -5.505936 1.31182 0.434978
H  -6.079389 -0.428873 -1.297755
H  2.865345 -2.886406 -1.097247
H  5.400518 -0.490636 1.493333
H  4.986802 -2.628563 0.234424
H  2.505131 4.047816 1.076529
