program: Gaussian 09
title: 000225564
version: EM64L-G09RevD.01
frameworkgroup: C1[X(C16H24O)]
method: RPBEPBE
basis: SDD
operation: Freq
keyword: #pfreq=noraman
keyword: PBEPBE/SDD
title: #p freq=noraman PBEPBE/SDD
converged: YES YES NO NO
title: Mulliken charges:
elementType: O C C C C C C C C C C C C C C C C H H H H H H H H H H H H H H H H H H H H H H H H
charge: -0.436876 0.039912 -0.246458 -0.031654 -0.541409 -0.477328 -0.446528 -0.046456 0.549977 -0.751656 -0.740316 -0.742088 -0.456790 -0.379537 -0.387089 -0.372990 0.273389 0.187548 0.197176 0.195549 0.199454 0.226170 0.209991 0.188855 0.195289 0.190743 0.195811 0.201775 0.236953 0.209434 0.205004 0.208987 0.229143 0.206129 0.208996 0.225790 0.232333 0.229954 0.215399 0.246116 0.351300
chargesum: 0.00000
title: Mulliken charges with hydrogens summed into heavy atoms:
elementType: O C C C C C C C C C C C C C C C C
charge: -0.085576 0.227460 -0.049282 0.163895 -0.115786 -0.078483 -0.060496 0.149355 0.549977 -0.103494 -0.097181 -0.101173 -0.224457 -0.149583 -0.171690 -0.126874 0.273389
polarizability: 2.24712439e+02 -1.40494506e+01 1.46180222e+02 2.58448794e+00 7.95287385e-01 1.49744505e+02
1716.lowfreq: -7.8042 -0.0003 0.0005 0.0009 8.3413 12.4990 33.1618 35.9958 51.5997
frequency: 33.1431 35.9310 51.4917 74.4075 84.4189 144.9653 177.3569 183.7425 193.3914 205.4975 219.0008 231.3049 243.2478 303.7579 332.4213 349.2535 353.6287 369.9278 378.2670 411.3608 411.8032 422.6129 432.0567 471.1639 492.3758 529.7900 559.2655 562.5303 635.7517 730.6728 751.4576 776.4539 804.4542 816.2738 826.9233 834.5571 861.0003 871.3008 913.0535 915.7914 928.1305 937.4519 942.8039 956.9917 960.2556 984.0245 1003.5039 1026.6139 1032.9016 1070.7218 1095.6990 1099.8181 1102.5069 1106.4538 1140.3845 1144.7815 1152.3073 1169.7860 1178.1130 1181.0842 1203.2140 1225.9792 1239.3804 1245.1388 1264.6522 1271.6229 1290.8645 1300.1168 1302.7543 1311.8561 1321.7744 1328.4296 1329.7731 1339.8523 1350.7098 1359.1918 1380.3944 1385.7515 1391.2465 1397.2631 1426.8960 1457.8798 1461.8359 1467.5520 1469.7535 1473.3235 1477.1787 1478.5423 1483.5386 1496.8696 1502.3669 1596.7320 1625.2993 2919.1955 2935.1655 2944.9137 2946.3340 2954.3277 2956.8245 2964.6218 2968.3294 2968.9676 2972.7077 3016.5989 3034.9718 3041.2698 3056.4314 3056.6233 3064.4062 3077.4802 3078.6220 3081.9996 3105.9641 3125.9638 3132.6830 3166.0906 3580.6789
redmass: 3.4638 2.6539 4.5318 2.7711 3.1559 3.3137 2.0897 2.1773 1.2131 1.7136 1.8583 1.5467 2.2357 2.5662 3.0414 1.1447 2.4329 2.3501 3.4334 2.8888 2.5843 2.7155 2.7528 2.8300 2.8258 2.5780 3.5910 2.5408 6.8978 3.6303 2.6777 2.8800 1.3996 3.4991 1.8312 1.6515 2.0294 1.9947 1.6171 1.2464 1.4898 1.7105 1.5528 1.4051 1.3707 1.6613 2.7489 2.6935 1.8976 1.3230 1.5364 2.3275 2.0049 2.3600 1.5191 2.0261 2.0091 1.7612 1.1852 1.7491 1.7621 1.7026 1.3308 2.8336 1.4383 1.3152 1.3308 1.2711 1.2707 1.3638 1.3458 1.3680 1.4205 1.5321 1.5103 1.5218 1.2117 1.2265 4.9303 1.2128 2.6445 1.0823 1.0847 1.0731 1.0705 1.0517 1.0524 1.0504 1.0572 1.0474 2.7409 6.3169 6.4956 1.0800 1.0796 1.0797 1.0767 1.0618 1.0734 1.0674 1.0392 1.0369 1.0372 1.0983 1.0962 1.0968 1.0983 1.0988 1.0980 1.0983 1.0984 1.0976 1.0874 1.0889 1.0955 1.0952 1.0659
irintensity: 0.7525 0.3718 0.0641 0.0577 0.1614 0.1730 0.2748 0.1362 0.1359 0.0057 0.1072 0.0238 0.0719 0.1099 0.5140 136.4860 6.5274 5.5309 1.2983 1.3110 4.6532 0.6063 1.9895 1.2610 5.8933 15.5252 5.3179 15.9448 1.2795 0.7193 5.1066 6.2395 29.9763 12.5910 5.8871 33.3236 1.1389 5.1703 1.9479 6.6735 2.3440 1.5832 5.4600 0.6078 0.7550 8.2534 3.7373 2.6898 7.9433 1.7884 23.7986 4.8646 4.4795 8.6862 214.5740 24.1478 4.2669 12.5107 9.6365 0.9327 1.9235 2.3432 3.6177 29.2841 3.9360 0.9722 0.4772 2.6707 5.4607 10.6213 7.4274 1.2882 0.9256 4.1808 2.2156 3.8780 17.5997 14.2705 13.0519 18.4229 9.7750 5.2612 8.0022 6.2257 3.3727 11.6362 3.0891 7.5006 6.8196 24.9002 104.8412 9.0927 26.7634 4.1395 0.8994 16.9640 8.9746 13.8086 20.3300 83.5471 71.3980 29.0522 40.3004 53.1866 39.4153 60.0992 54.9042 0.4916 101.2865 31.5010 49.3805 46.9521 21.4329 22.2548 14.0562 6.9564 37.7114
temp: 298.150 k
press: 1.00000 atm
elementType: 8 6 6 6 6 6 6 6 6 6 6 6 6 6 6 6 6 1 1 1 1 1 1 1 1 1 1 1 1 1 1 1 1 1 1 1 1 1 1 1 1
symmnumber: 1
zpe: 945163.8 jmol-1
zpe.correction: 0.359994 hartree
zpe.thermalcorrener: 0.377676 hartree
zpe.thermalcorrenthalpy: 0.378620 hartree
zpe.thermalcorrgfe: 0.314429 hartree
zpe.sumelectzpe: -698.016808 hartree
zpe.sumelectthermal: -697.999126 hartree
zpe.sumelectthermalent: -697.998182 hartree
zpe.sumelectthermalfe: -698.062374 hartree
dipole: -0.4512 0.1584 1.5075
dipole: 1.5815
quadrupole: -102.1694 -108.9049 -99.8846
quadrupole: -1.9517 10.3112 -2.0532
quadrupole: 1.4836 -5.2520 3.7684 -1.9517 10.3112 -2.0532
hfenergy: -698.3768023 hartree
pointgroup: C01 [X(C16H24O1)]
dipole: -0.1791054 0.0663327 0.5921577 debye
polarizability: 225.3306741|-12.1420574|145.5848939|2.7573196|0.9102013|149.7215979 unknown
InChI: InChI=1S/C16H24O/c1-11(2)14-5-4-12(3)16(10-14)13-6-8-15(17)9-7-13/h6-9,11-12,14,16-17H,4-5,10H2,1-3H3
charge 0 multiplicity 1
41 atoms
O  5.315689 -1.078522 -0.397221
C  -2.643436 -0.239502 0.207883
C  -0.174745 0.551149 0.437038
C  -0.521934 1.902144 -0.263685
C  -1.146751 -0.578059 -0.018737
C  -2.968475 1.11352 -0.478186
C  -2.013966 2.240796 -0.027018
C  -3.583957 -1.392161 -0.271983
C  1.279787 0.128226 0.236713
C  0.387233 3.057677 0.207314
C  -3.266886 -2.739121 0.426765
C  -5.081237 -1.049434 -0.062465
C  2.150509 -0.047546 1.339367
C  1.805015 -0.11398 -1.062542
C  3.495071 -0.448557 1.166585
C  3.141717 -0.511321 -1.257395
C  3.989094 -0.679429 -0.137995
H  -2.804779 -0.112911 1.30379
H  -0.33568 0.707917 1.526868
H  -0.375105 1.763064 -1.357746
H  -0.985348 -0.781292 -1.09921
H  -0.872472 -1.504119 0.519224
H  -4.01042 1.415007 -0.262803
H  -2.893235 0.982853 -1.579446
H  -2.266021 3.182099 -0.555315
H  -2.1659 2.436785 1.056361
H  -3.413711 -1.525079 -1.363598
H  0.284771 3.215541 1.299128
H  1.451166 2.852698 -0.005541
H  0.112017 4.004032 -0.295342
H  -3.343879 -2.635802 1.527123
H  -3.986517 -3.517813 0.11213
H  -2.254369 -3.109341 0.1899
H  -5.284817 -0.818461 1.001761
H  -5.718502 -1.907461 -0.346895
H  -5.403487 -0.182977 -0.665872
H  1.773997 0.134128 2.353484
H  1.160559 0.012679 -1.94076
H  4.148681 -0.577224 2.039851
H  3.545404 -0.695271 -2.257715
H  5.824418 -1.166631 0.446689
