program: Gaussian 09
title: 000225554
version: EM64L-G09RevD.01
frameworkgroup: C1[X(C10H19IO2)]
method: RPBEPBE
basis: SDD
operation: Freq
keyword: #p
keyword: freq=noraman
keyword: PBEPBE/SDD
title: #p freq=noraman PBEPBE/SDD
converged: YES YES NO NO
title: Mulliken charges:
elementType: I O O C C C C C C C C C C H H H H H H H H H H H H H H H H H H H
charge: 0.087540 -0.242677 -0.230891 0.015048 -0.424925 -0.416210 -0.365790 -0.368815 -0.356613 -0.722638 -0.696502 0.365887 -0.863954 0.210668 0.206760 0.187267 0.204568 0.213862 0.190526 0.204898 0.243864 0.225751 0.194889 0.197324 0.213725 0.214404 0.251958 0.217554 0.210771 0.210392 0.311394 0.309968
chargesum: 0.00000
title: Mulliken charges with hydrogens summed into heavy atoms:
elementType: I O O C C C C C C C C C C
charge: 0.087540 -0.242677 -0.230891 0.225715 -0.030898 0.002220 0.029633 0.100800 0.035600 -0.042552 -0.057785 0.365887 -0.242592
polarizability: 1.84122177e+02 8.90857128e+00 1.22293064e+02 5.12699479e+00 4.09946166e+00 1.02964446e+02
1716.lowfreq: -8.6568 -4.2621 -0.0005 0.0003 0.0004 10.5337 16.8391 27.1332 31.7476
frequency: 16.4273 27.1163 31.6490 50.0340 64.5502 73.7920 102.7746 106.9014 129.6368 143.7618 196.0116 229.9218 240.4430 259.3382 281.4931 287.2014 312.6360 393.3274 442.2552 463.6808 508.9156 532.4289 626.5777 709.8048 728.2768 758.9241 774.0399 789.4686 804.6864 869.1278 889.1334 913.7526 943.4929 968.4573 975.5623 997.5768 1025.3324 1039.4173 1076.7893 1077.2570 1091.6418 1138.4888 1152.8074 1161.3560 1197.0450 1209.1614 1216.6399 1234.0904 1251.0063 1265.3175 1277.8711 1288.7507 1296.1886 1329.9900 1343.1398 1354.2386 1359.3028 1369.6315 1389.8019 1399.8949 1422.4550 1456.8123 1465.8608 1469.2491 1476.7655 1477.5019 1482.4825 1486.1107 1491.0883 1495.7238 1629.4456 2954.6826 2958.6308 2963.2115 2968.8012 2972.7247 2980.9513 2987.6654 2996.9049 3010.3375 3021.0638 3028.2357 3036.5242 3068.8928 3070.7133 3072.6624 3082.2076 3084.8376 3093.0812 3183.2327
redmass: 5.1132 4.5566 4.0596 5.0141 2.2543 2.3938 2.5713 5.6925 3.1703 2.1474 2.0358 1.1314 1.6257 3.0938 4.2832 2.1708 2.3155 3.0446 3.4888 4.5681 2.5325 2.3979 4.8136 6.9314 1.1085 1.5834 1.5460 2.9016 1.3826 1.8652 1.8103 1.3310 4.0747 2.1119 2.1257 1.7140 1.4611 2.4059 1.5937 2.1723 2.0163 1.9313 2.2644 2.3038 1.1718 1.4906 2.0374 1.3251 1.2595 1.2207 1.1456 1.0731 1.2611 1.4498 1.5303 1.5366 1.3731 1.3600 1.2158 1.2147 1.1241 1.0829 1.0711 1.0790 1.0566 1.0475 1.0624 1.0742 1.0718 1.0589 9.3728 1.0593 1.0598 1.0798 1.0604 1.0362 1.0371 1.0663 1.0941 1.1012 1.0574 1.0986 1.1037 1.1007 1.0988 1.0993 1.1006 1.0554 1.1082 1.1120
irintensity: 0.0519 0.3963 0.5634 0.4520 0.5625 0.1089 0.2079 0.3795 0.9521 1.0704 1.2764 0.0193 0.3298 0.9379 5.4729 4.6051 3.7026 4.5921 2.4842 13.6364 8.2833 2.2341 12.4484 1.0911 8.9383 5.4040 8.3455 8.5879 4.7771 7.8079 9.1362 4.1615 68.2941 4.5905 3.4487 37.2680 2.2344 0.3538 117.5372 45.6289 10.5285 1.4715 0.7576 0.4792 13.7931 8.7926 219.0840 54.4545 18.3852 1.2504 1.2168 0.9734 1.3969 0.9578 0.4742 0.5639 3.4236 0.9252 11.6745 24.9687 21.4704 4.7638 0.9678 8.3379 9.4740 9.5494 11.0867 28.3334 4.3856 7.3710 179.1213 6.9946 5.7991 9.1472 83.9644 38.3091 32.6770 28.9332 16.1484 5.0939 28.0686 39.4640 67.1861 85.4878 53.8555 47.9707 43.0177 3.6328 12.5354 0.0414
temp: 298.150 k
press: 1.00000 atm
elementType: 53 8 8 6 6 6 6 6 6 6 6 6 6 1 1 1 1 1 1 1 1 1 1 1 1 1 1 1 1 1 1 1
symmnumber: 1
zpe: 718221.1 jmol-1
zpe.correction: 0.273556 hartree
zpe.thermalcorrener: 0.290338 hartree
zpe.thermalcorrenthalpy: 0.291282 hartree
zpe.thermalcorrgfe: 0.224369 hartree
zpe.sumelectzpe: -553.350551 hartree
zpe.sumelectthermal: -553.333769 hartree
zpe.sumelectthermalent: -553.332824 hartree
zpe.sumelectthermalfe: -553.399738 hartree
dipole: 2.2334 -0.7490 1.4514
dipole: 2.7669
quadrupole: -94.0066 -97.9067 -96.0707
quadrupole: -1.0339 -3.3705 5.5811
quadrupole: 1.9880 -1.9120 -0.0760 -1.0339 -3.3705 5.5811
hfenergy: -553.6241068 hartree
pointgroup: C01 [X(C10H19I1O2)]
dipole: -0.9130391 -0.0520827 -0.5904457 debye
polarizability: 181.8200715|-15.4046347|125.4315113|-0.6107326|1.7395023|102.1281045 unknown
InChI: InChI=1S/C10H19IO2/c1-3-5-6-9(4-2)8-13-10(12)7-11/h9H,3-8H2,1-2H3
charge 0 multiplicity 1
32 atoms
I  5.32927 -1.181042 -0.416988
O  1.756985 -0.459379 -0.42647
O  2.603514 0.999922 1.201473
C  -0.712785 -0.116351 -0.351788
C  -1.997714 -0.638453 0.352407
C  -0.644905 1.432301 -0.471844
C  -3.312752 -0.219443 -0.343215
C  0.512972 -0.708823 0.369299
C  -4.55854 -0.89416 0.275946
C  -0.704769 2.211561 0.862141
C  -5.875835 -0.457079 -0.400208
C  2.716505 0.38944 0.113192
C  3.912608 0.478852 -0.810125
H  -0.710717 -0.526677 -1.384475
H  -2.017819 -0.297633 1.407811
H  -1.956259 -1.74774 0.387429
H  0.287807 1.700642 -1.006792
H  -1.47233 1.765497 -1.127643
H  -3.256653 -0.475588 -1.422162
H  -3.436284 0.88075 -0.289154
H  0.65182 -0.286069 1.379965
H  0.443559 -1.808954 0.425381
H  -4.450702 -1.995762 0.202745
H  -4.600647 -0.657818 1.358947
H  -1.637472 2.005046 1.418913
H  -0.670315 3.299605 0.670219
H  0.152342 1.967424 1.514584
H  -6.750458 -0.955861 0.05612
H  -6.024581 0.635547 -0.309425
H  -5.869611 -0.705501 -1.478395
H  4.486031 1.393551 -0.61405
H  3.630434 0.370097 -1.865539
