program: Gaussian 09
title: 000225597
version: EM64L-G09RevD.01
frameworkgroup: C1[X(C17H30O6)]
method: RPBEPBE
basis: SDD
operation: Freq
keyword: #pfreq=noraman
keyword: PBEPBE/SDD
title: #p freq=noraman PBEPBE/SDD
converged: YES YES NO NO
title: Mulliken charges:
elementType: O O O O O O C C C C C C C C C C C C C C C C C H H H H H H H H H H H H H H H H H H H H H H H H H H H H H H
charge: -0.260691 -0.276537 -0.279770 -0.253749 -0.233614 -0.240902 0.093769 -0.421275 -0.437838 -0.133314 -0.392146 -0.398940 0.214850 0.207839 -0.720716 0.197578 -0.704677 -0.265987 -0.261099 -0.262615 -0.671609 -0.665082 -0.679506 0.225541 0.223534 0.225035 0.239658 0.233936 0.231098 0.212223 0.217765 0.204499 0.208834 0.242949 0.239446 0.214075 0.216408 0.231923 0.228380 0.236818 0.222560 0.234453 0.212432 0.234705 0.216485 0.224947 0.256980 0.256353 0.221065 0.217565 0.212218 0.242760 0.261388
chargesum: 0.00000
title: Mulliken charges with hydrogens summed into heavy atoms:
elementType: O O O O O O C C C C C C C C C C C C C C C C C
charge: -0.260691 -0.276537 -0.279770 -0.253749 -0.233614 -0.240902 0.093769 0.027800 0.026854 0.100622 0.051175 0.023324 0.214850 0.207839 -0.029487 0.197578 -0.042272 0.199211 0.195914 0.184521 0.026803 0.029901 0.036860
polarizability: 2.04307113e+02 -6.01040012e+00 2.12576501e+02 -5.92766004e-01 2.24317271e+00 1.87757198e+02
1716.lowfreq: -7.6325 -2.5605 -0.0005 0.0002 0.0007 3.8916 17.0107 21.5229 23.9229
frequency: 16.4388 20.9002 23.7367 33.6623 36.3428 48.9635 52.5201 57.3083 70.9270 75.8357 84.9245 95.2357 98.5347 108.4075 115.7438 145.6041 152.1376 165.4191 177.4200 192.9260 194.7920 203.4048 217.0095 227.9376 239.2290 248.2226 258.7164 276.6490 306.4614 308.7761 312.8489 329.8249 360.9982 379.5846 393.9038 413.1409 428.2163 443.0333 484.9663 523.8818 567.6535 585.8013 650.5794 702.7216 704.8980 718.8465 735.8787 750.2945 759.2861 770.5747 794.6536 811.0215 813.8146 816.4584 817.8751 826.5227 865.4689 902.9243 920.8021 933.0913 992.8672 993.0578 1010.0826 1012.7893 1016.8394 1029.5663 1048.1803 1070.1050 1085.0580 1087.4956 1088.9815 1095.4519 1096.9565 1098.3680 1109.8520 1125.9448 1143.1347 1153.7789 1156.2578 1157.4322 1165.7151 1202.2181 1234.8732 1256.6889 1265.7958 1275.3132 1276.7810 1277.7923 1282.2234 1304.5130 1325.6154 1328.5614 1335.4238 1340.8181 1351.4750 1354.4539 1356.6220 1370.2531 1390.6777 1392.9699 1395.8974 1397.4504 1398.0289 1445.9847 1455.5138 1455.7329 1458.0162 1460.2695 1462.2292 1462.5047 1464.6975 1465.1837 1474.8391 1475.6362 1477.3147 1481.8422 1482.7340 1485.0778 1489.9937 1490.9050 1617.7828 1628.0793 1629.3650 2979.4851 2982.1150 2987.4303 2989.6779 2990.6652 2991.7583 2992.2313 2993.2656 3005.6733 3014.8224 3023.7768 3028.2821 3032.4878 3038.7805 3047.5466 3052.2752 3076.8370 3078.6948 3081.7476 3084.2330 3085.0723 3086.1929 3086.8561 3087.8852 3093.0003 3093.2177 3100.3162 3113.5247 3118.1907 3119.4495
redmass: 3.2744 4.4779 4.2699 3.1051 3.8821 3.4415 3.8095 3.7428 3.0212 3.2550 3.4033 3.1210 2.7648 3.5023 3.2512 3.1699 2.2708 2.8590 2.1908 1.6910 1.8970 1.6366 1.2731 1.4428 1.3772 1.8632 1.5982 3.4837 2.9238 2.8449 2.9036 3.4744 6.3117 3.6310 3.6727 4.1100 3.2467 3.5419 3.6807 4.0397 4.9149 2.5146 2.7193 4.9679 4.1501 3.9351 2.8525 2.6599 1.6284 1.6034 1.4121 1.5120 1.7463 1.5211 1.8700 2.4061 2.3452 1.9613 2.2277 2.9832 2.4756 1.9512 2.5104 2.5966 2.4665 3.1198 2.1581 3.1275 2.5365 2.8634 2.1722 2.1223 2.1666 2.2357 2.8511 2.8187 2.0124 1.7889 1.6967 1.7701 3.9429 2.8470 1.6134 1.3068 1.1964 1.1252 1.1253 1.1180 1.2389 1.2878 1.3583 1.3750 1.4111 1.2274 1.2797 1.2935 1.3447 1.3945 1.2324 1.2314 1.2238 1.2105 1.2144 1.0791 1.0932 1.0955 1.1049 1.0740 1.0458 1.0452 1.0807 1.0472 1.0744 1.0443 1.0457 1.0548 1.0584 1.0534 1.0491 1.0524 9.0709 9.5971 9.3258 1.0409 1.0550 1.0592 1.0363 1.0479 1.0361 1.0361 1.0501 1.0840 1.0612 1.0590 1.0592 1.0592 1.1003 1.1002 1.1002 1.0997 1.1007 1.0986 1.0980 1.1008 1.0982 1.0978 1.1038 1.1026 1.1029 1.1007 1.1054 1.1058 1.1066
irintensity: 0.4171 0.7987 0.5467 0.3571 0.1086 1.0573 1.5220 0.1940 0.5035 1.9897 0.7777 1.0407 0.3711 3.3462 0.2469 0.4604 0.8199 1.7757 0.8363 2.5109 3.1690 3.7367 1.7092 1.2042 0.3268 0.8434 0.2408 0.4680 6.8020 5.0571 10.1173 11.7895 4.4729 1.3102 3.7162 1.1247 5.4915 4.8092 7.8241 10.4226 4.5418 0.3456 0.3948 1.5895 3.8852 1.3287 16.4860 11.9791 12.4429 5.7478 4.9745 10.7093 1.9367 4.5688 0.0624 0.7595 6.4557 5.6161 59.1415 9.0651 7.8254 0.4816 50.8395 94.9515 13.6393 54.8913 38.8768 6.2411 68.3239 138.1557 130.7676 15.1316 8.5381 19.7340 5.1597 82.2995 147.8223 14.0713 2.2883 17.0616 135.4085 25.6980 52.3949 28.8948 4.7478 0.0903 7.2780 3.3857 21.7802 3.5591 5.1724 4.6653 7.9452 1.5992 2.0810 0.2642 4.9003 6.5567 24.9803 23.7271 13.5940 26.8043 12.2262 0.1968 4.1801 21.8523 16.6547 10.5847 24.7163 14.6914 2.1696 5.3521 2.8340 11.7926 14.1784 10.1542 18.1214 12.7649 6.6701 28.6913 138.5995 300.4297 16.1939 42.5748 17.5895 7.9716 15.1886 34.7377 16.6153 21.8146 18.5060 7.1355 27.4119 38.4496 33.9162 28.5539 11.1509 0.1155 12.1234 39.3186 33.6062 30.3868 65.4204 42.6202 31.6796 24.4192 0.8359 3.8464 4.0952 27.6553 27.3552 29.3679 26.3785
temp: 298.150 k
press: 1.00000 atm
elementType: 8 8 8 8 8 8 6 6 6 6 6 6 6 6 6 6 6 6 6 6 6 6 6 1 1 1 1 1 1 1 1 1 1 1 1 1 1 1 1 1 1 1 1 1 1 1 1 1 1 1 1 1 1
symmnumber: 1
zpe: 1177994.5 jmol-1
zpe.correction: 0.448674 hartree
zpe.thermalcorrener: 0.477477 hartree
zpe.thermalcorrenthalpy: 0.478421 hartree
zpe.thermalcorrgfe: 0.385470 hartree
zpe.sumelectzpe: -1115.316712 hartree
zpe.sumelectthermal: -1115.287909 hartree
zpe.sumelectthermalent: -1115.286965 hartree
zpe.sumelectthermalfe: -1115.379917 hartree
dipole: -0.4313 1.5882 2.3166
dipole: 2.8417
quadrupole: -143.8005 -132.1453 -136.2221
quadrupole: -13.6887 11.6379 -1.9155
quadrupole: -6.4112 5.2440 1.1672 -13.6887 11.6379 -1.9155
hfenergy: -1115.7653864 hartree
pointgroup: C01 [X(C17H30O6)]
dipole: -0.1558991 0.485204 0.9951032 debye
polarizability: 205.8657703|-6.3137592|209.6453481|-3.7714053|5.2841428|189.1296928 unknown
InChI: InChI=1S/C17H30O6/c1-6-13(14(18)21-8-3)11-12-17(7-2,15(19)22-9-4)16(20)23-10-5/h13H,6-12H2,1-5H3
charge 0 multiplicity 1
53 atoms
O  -0.766341 -1.562811 1.375013
O  -2.758633 1.199471 -0.35577
O  3.026824 0.071842 -0.271163
O  0.048834 -2.723251 -0.469896
O  -3.443948 -0.848044 0.509917
O  3.21751 1.329963 -2.224546
C  -1.361753 -0.729698 -0.837216
C  -0.290308 0.354661 -1.212547
C  0.3570 1.122218 -0.039572
C  1.566342 1.985301 -0.490759
C  -1.854099 -1.389693 -2.180562
C  2.134292 2.812483 0.701669
C  -0.642877 -1.795404 0.013521
C  -2.600252 -0.171389 -0.118651
C  -2.834852 -2.570871 -2.047737
C  2.668123 1.130144 -1.115572
C  3.289678 3.759487 0.315153
C  -0.054821 -2.50587 2.296181
C  -3.990251 1.829613 0.216213
C  4.07268 -0.872239 -0.779452
C  1.327945 -1.95627 2.656316
C  -3.756911 2.249804 1.669919
C  3.453365 -1.939004 -1.687438
H  0.492643 -0.179216 -1.786402
H  -0.769566 1.072361 -1.903517
H  -0.394715 1.788573 0.421766
H  0.700658 0.422321 0.741079
H  1.249996 2.686151 -1.288069
H  -0.94388 -1.733496 -2.706333
H  -2.303182 -0.583769 -2.793601
H  2.466188 2.110856 1.491065
H  1.297962 3.402633 1.126131
H  -3.118865 -2.93148 -3.053359
H  -3.75584 -2.291051 -1.50916
H  -2.366635 -3.413182 -1.509385
H  3.621464 4.350185 1.18838
H  2.979288 4.466186 -0.476662
H  4.163933 3.200643 -0.06512
H  -0.721184 -2.565495 3.171355
H  0.015027 -3.489563 1.800285
H  -4.168606 2.693436 -0.444165
H  -4.821689 1.107355 0.137144
H  4.493972 -1.305491 0.142395
H  4.842648 -0.286063 -1.311749
H  1.823444 -2.641101 3.369602
H  1.24785 -0.962999 3.130906
H  1.963907 -1.865791 1.759666
H  -3.577056 1.367158 2.305792
H  -2.892898 2.932197 1.750765
H  -4.650139 2.777018 2.05362
H  4.218724 -2.69602 -1.942329
H  3.092105 -1.489495 -2.627725
H  2.610199 -2.450006 -1.190799
