program: Gaussian 09
title: 000225555
version: EM64L-G09RevD.01
frameworkgroup: C1[X(C10H22Cl2NPS)]
method: RPBEPBE
basis: SDD
operation: Freq
keyword: #p
keyword: freq=noraman
keyword: PBEPBE/SDD
title: #p freq=noraman PBEPBE/SDD
converged: YES YES NO NO
title: Mulliken charges:
elementType: Cl Cl S P N C C C C C C C C C C H H H H H H H H H H H H H H H H H H H H H H
charge: -0.150584 -0.164087 -0.128368 0.451235 -0.657904 -0.385313 -0.381452 -0.381406 -0.376012 -0.373558 -0.380895 -0.352962 -0.356752 -0.303900 -0.695637 0.197178 0.194663 0.199860 0.194911 0.192511 0.194334 0.198339 0.202836 0.191270 0.189992 0.195945 0.230538 0.187767 0.188565 0.238652 0.247101 0.194815 0.195587 0.209919 0.216151 0.209683 0.366982
chargesum: 0.00000
title: Mulliken charges with hydrogens summed into heavy atoms:
elementType: Cl Cl S P N C C C C C C C C C C
charge: -0.150584 -0.164087 -0.128368 0.451235 -0.290922 0.006527 0.013318 0.005438 0.025163 0.007704 0.045587 0.023370 0.033650 0.181852 -0.059883
polarizability: 2.39827570e+02 4.88704741e+00 1.74254898e+02 6.79004557e+00 7.24846624e+00 1.57632392e+02
1716.lowfreq: -25.9870 -6.3689 -0.0022 -0.0019 0.0024 1.3709 11.1401 15.4221 20.0815
frequency: -21.6250 14.9230 19.8215 29.5752 48.6958 57.8861 66.1206 89.6068 102.3453 109.8103 113.1379 123.9017 129.6480 136.9932 145.2250 154.4926 192.1480 202.0321 216.4869 225.1684 280.4761 293.0207 365.9194 373.5534 396.7986 447.0462 475.3668 496.5823 517.0159 591.7225 719.4344 723.4228 732.9843 752.8023 787.5621 831.5017 858.0145 887.2380 909.4969 969.7960 982.4649 1001.1328 1020.3030 1023.5248 1052.3427 1064.1025 1074.9257 1080.0473 1083.1098 1087.6914 1122.0745 1147.9580 1184.0723 1206.9121 1213.1963 1240.2804 1245.8955 1267.5138 1276.1487 1278.7338 1285.5020 1288.1009 1295.1521 1296.8535 1306.4221 1330.2060 1347.3296 1352.1140 1354.9434 1355.7233 1387.8800 1391.1717 1458.7377 1459.1094 1463.1563 1463.8859 1467.6676 1473.1029 1476.2332 1478.7159 1483.6047 1488.5752 1490.0168 2950.1005 2950.2137 2952.4917 2955.5422 2959.6725 2962.8501 2967.5184 2969.0581 2972.0587 2972.3516 2983.4142 2988.8612 2996.5743 3006.9098 3017.9741 3028.8867 3037.8754 3043.9699 3062.5977 3068.3747 3071.4352 3516.4749
redmass: 1.8295 6.3730 4.5636 4.8877 2.4355 2.3186 3.4750 2.0707 3.7496 4.7581 3.4006 2.9410 5.4107 2.5417 2.4259 3.5518 4.7964 9.2697 5.0565 1.1298 6.8208 3.3308 5.9821 4.6414 4.5802 4.3854 3.1567 2.8511 1.5761 12.0224 1.0605 1.0711 1.0892 1.1294 1.2159 1.8281 1.9683 1.8971 1.2701 1.2385 4.7006 3.8433 1.9111 1.5750 3.2751 2.9885 2.4387 2.2627 2.4151 3.9051 2.9391 1.4502 1.7666 1.3162 1.4248 1.3169 1.3073 1.2475 1.2440 1.0444 1.0856 1.1185 1.0961 1.1188 1.2922 1.3455 1.4290 1.6801 1.6090 1.5190 1.2163 1.2426 1.0729 1.0734 1.0641 1.0743 1.0786 1.0786 1.0428 1.0812 1.0878 1.0898 1.0876 1.0586 1.0585 1.0591 1.0592 1.0597 1.0604 1.0611 1.0591 1.0367 1.0639 1.0963 1.0978 1.0998 1.1015 1.1024 1.1023 1.1019 1.1027 1.1030 1.1007 1.0992 1.0762
irintensity: 0.0972 1.1043 0.7226 0.3857 0.4963 0.4406 0.2435 0.3010 1.2061 0.2650 1.0915 0.6552 0.5564 0.4541 0.2281 0.7040 0.1765 4.6942 3.6216 0.0079 16.2648 0.8293 30.5696 23.0447 34.4109 10.3013 20.7589 7.9618 144.1655 98.5969 16.3441 0.2591 8.3409 0.9241 7.1849 31.3503 37.1548 5.2230 2.2517 0.6781 1.4386 1.4370 3.6328 1.5645 9.4332 1.1686 13.9730 3.9969 0.8423 66.7012 37.0096 3.7300 1.5093 29.4565 1.7748 6.5041 0.1404 5.2342 0.9810 0.2872 1.2806 0.8378 0.0943 0.6308 0.7684 0.6924 0.8060 0.9372 0.5184 1.0896 11.3063 31.0652 0.0237 0.1527 0.6253 0.5884 1.9150 0.2170 12.2719 3.9200 1.3447 14.1615 30.7958 0.0357 0.1331 0.4158 0.0953 9.4397 21.8082 8.8148 145.4862 35.5427 126.3077 0.5131 0.4083 0.6317 0.6595 1.8952 1.6573 32.2295 151.1246 66.8501 100.1034 54.4280 55.1710
temp: 298.150 k
press: 1.00000 atm
elementType: 17 17 16 15 7 6 6 6 6 6 6 6 6 6 6 1 1 1 1 1 1 1 1 1 1 1 1 1 1 1 1 1 1 1 1 1 1
symmnumber: 1
zpe: 812680.8 jmol-1
zpe.correction: 0.309534 hartree
zpe.thermalcorrener: 0.330329 hartree
zpe.thermalcorrenthalpy: 0.331273 hartree
zpe.thermalcorrgfe: 0.254810 hartree
zpe.sumelectzpe: -2107.201813 hartree
zpe.sumelectthermal: -2107.181018 hartree
zpe.sumelectthermalent: -2107.180074 hartree
zpe.sumelectthermalfe: -2107.256537 hartree
dipole: -5.7883 0.6687 0.8733
dipole: 5.8918
quadrupole: -159.8024 -126.0559 -126.7293
quadrupole: 2.6702 0.9308 1.6650
quadrupole: -22.2732 11.4733 10.8000 2.6702 0.9308 1.6650
hfenergy: -2107.5113467 hartree
pointgroup: C01 [X(C10H22Cl2N1P1S1)]
dipole: 2.2751474 -0.2454912 0.3697437 debye
polarizability: 239.8878725|5.6029061|174.453684|-5.6738006|-7.1153101|157.3733034 unknown
InChI: InChI=1S/C10H22NPS.2Cl/c1-2-3-4-5-6-7-8-9-10-11-12-13;;/h11H,2-10H2,1H3;;
charge 0 multiplicity 1
37 atoms
Cl -6.522874 -1.921503 -1.090444
Cl -6.857697 0.153868 1.638464
S  -5.765624 1.71491 -1.478447
P  -5.658188 0.037051 -0.321846
N  -4.099726 -0.51916 0.088973
C  2.223983 0.44255 0.080083
C  0.942556 -0.412195 -0.043338
C  3.52115 -0.385732 -0.059561
C  -0.354821 0.40193 0.162661
C  4.805978 0.469622 0.018169
C  -1.627358 -0.459781 -0.005853
C  6.102496 -0.367025 -0.068682
C  7.388901 0.488664 -0.014527
C  -2.911495 0.350829 0.260243
C  8.678471 -0.357932 -0.082135
H  2.210489 1.2379 -0.694085
H  2.226857 0.962845 1.060752
H  0.91982 -0.894519 -1.042532
H  0.979892 -1.236022 0.699898
H  3.548243 -1.158901 0.736774
H  3.505204 -0.934503 -1.024486
H  -0.343487 0.857366 1.174398
H  -0.380469 1.242442 -0.560926
H  4.797429 1.218958 -0.800903
H  4.806346 1.04656 0.966814
H  -1.578836 -1.318999 0.695766
H  -1.669544 -0.878867 -1.029252
H  6.119691 -1.103874 0.761697
H  6.097053 -0.958758 -1.008158
H  -2.887928 0.781254 1.282453
H  -2.995365 1.187271 -0.457262
H  7.387375 1.089237 0.918153
H  7.377754 1.215846 -0.852004
H  8.71754 -0.946218 -1.01849
H  9.583309 0.276174 -0.043589
H  8.728815 -1.070639 0.762772
H  -4.042839 -1.470553 0.467849
